{"text_format":"3","workbook":"xlsx","n_sheets":20,"sheets":["coverSheet","Worksheet 1","Worksheet 2","Worksheet 3","Worksheet 3a Overview","Worksheet 3b Overview","Worksheet 4","Worksheet 5","Worksheet 6","Worksheet 6a","Worksheet 6b","Worksheet 7a","Worksheet 7b)","Worksheet 8","Worksheet 9","Worksheet 9a","Worksheet 10","Worksheet 11","Worksheet 15","Worksheet 16"],"not_rendered":{"charts":3,"images":12,"defined_names":23,"comments":1},"read":"whole","date_system":"1900"}

{"sheet":"coverSheet","index":0,"n_rows":35,"n_cols":2,"rows_kept":35,"merged":[[2,0,2,5],[4,1,4,5],[5,1,5,5],[6,1,6,5],[7,1,7,5],[8,1,8,5],[9,1,9,5],[10,1,10,5],[11,1,11,5],[13,0,13,5],[14,0,14,5],[16,0,16,1],[17,0,17,1],[19,0,20,5],[22,0,22,5],[24,0,24,5],[26,0,26,5],[28,0,28,5],[30,0,30,5],[32,0,32,5],[34,0,34,5]]}
[]
[]
["ISO 12217-2:2017     SAILING BOATS OF LENGTH GREATER THAN OR EQUAL TO 6m"]
[null,"Monohulls only "]
["Manufacturer:"]
["Signatory, Name:"]
["Signatory, Title:"]
["Phone:"]
["Email:"]
["WWW:"]
["CIN Model Year:"]
["Model Name:"]
[]
["This calculation sheet is provided by IMCI \"as is\" and any express or implied warranties, including, but not limited to, the implied warranties of fitness for a particular purpose are disclaimed."]
[]
[]
["blue cells are derived values"]
["yellow cells require data input"]
[]
["Please make sure to set your signature on the summary! (worksheet 16)\neither digitally or print summary, sign and attach scan"]
[]
[]
["  - most worksheets have additional comments / remarks / other calculations beside the printout area; please take into account."]
[]
["  - If curves or righting moments are required, please fill in worksheets 6a and 6b or attach curve of righting moments for both loading conditions  to the documentation."]
[]
["  - For boats with quick-draining cockpit the cockpit calculation according to ISO 11812 shall be enclosed to the documentation."]
[]
["  - Please attach other detailed information as appropriate, e.g. photos, sketches etc. for sill height, openings, companion way doors, location of flooding points, practical tests etc."]
[]
["  - Please think before printing the complete workbook; often some of the worksheets are not needed. In this case please print out only single worksheets"]
[]
["-  When entering data, please use the correct separator for your Excel version, many application problems are the result of incorrect separators ( , or . )"]
[]
["- Please be aware that there is NO technical difference between the requirements of ISO 12217-2:2015 and ISO 12217-2:2017; change of the name is just because of the harmonisation process; for FDIS ISO 12217-2:2020 the main change is exclusion of optional equipment from the maximum load and the result of the \"maximum recommended load for builder's plate\" (With ISO 14945 and ISO 14946 renamed to \"maximum load for the builder's plate, mMBP\") which exludes OB engine weights and the optional equipment."]

{"sheet":"Worksheet 1","index":1,"n_rows":60,"n_cols":53,"rows_kept":60,"merged":[[0,0,0,9],[0,11,0,12],[2,0,2,9],[3,0,3,9],[5,0,5,9],[8,0,8,5],[13,1,14,5],[13,7,14,7],[13,8,14,8],[13,11,15,24],[39,11,39,28],[44,14,44,32],[49,0,49,9],[59,11,61,16]]}
[{"$nulls":11},"Comments"]
[{"$nulls":12},"Derived values"]
["ISO 12217-2:2017   SAILING BOATS OF LENGTH GREATER THAN OR EQUAL TO 6m",{"$nulls":11},"Input values"]
["CALCULATION WORKSHEET No. 1"]
["ISO 12217-2:2017 en210301"]
[{"$f":"CONCATENATE(coverSheet!B5,\"          \",coverSheet!B12)","v":"          "}]
[]
["Design Category intended:",{"$nulls":4},"Monohull / multihull:",null,"Monohull"]
["Item",{"$nulls":5},"Symbol","Unit","Value","Ref.",{"$nulls":41},"list:","list:"]
["Length of hull as in ISO 8666",{"$nulls":5},"LH","m",null,"3.4.1",{"$nulls":41},"A","Monohull"]
["Length of waterline in loaded arrival condition",{"$nulls":5},"Lwl","m",null,"3.4.2",{"$nulls":41},"B","Multihull"]
["Empty Craft condition mass",{"$nulls":5},"mEC","kg",null,"3.5.1",{"$nulls":41},"C"]
[null,"standard equipment",{"$nulls":5},"kg",null,"3.6.12",null,"Please be aware that 3.6.12 is including OB engines weights and the essential safety equipment (as listed in 3.6.5*)",{"$nulls":39},"D"]
[null,"water ballast in tanks which are notified in the owner's manual to be filled when the boat is afloat",{"$nulls":5},"kg",null,"3.5.2",null,"* 3.6.5 requires the mass of the liferaft only for design cat. A&B. The RCD requires a storage place for the liferaft also for design cat C&D boats longer than 6m!\nTherefore IMCI (in accordance with ERFU 118) recommends to take the mass of the liferaft into account for cat C&D boats >6m also; please add to the essential safety equipment."]
[{"$nulls":26},"mLC +75 for wind stiffness test"]
["Light craft condition mass",{"$nulls":5},"mLC","kg",{"$f":"I12+I13+I14","v":{"v":0,"d":"0.0"}},"3.5.2",{"$nulls":16},{"$f":"I16+75","v":{"v":75,"d":"75.0"}}]
["Mass of:",{"$nulls":9},"ATTENTION"]
["Desired crew limit",{"$nulls":5},"CL"," ----",null,"3.6.3","Please insert here 100 % of the masses of the fluids."]
["Mass of:",{"$nulls":9},"For the calculation of the maximum load (mL) each fluid mass will be factored, see clause 3.5.4"]
[null,"desired crew limit at 75 kg each",{"$nulls":5},"kg",{"$f":"I18*75","v":{"v":0,"d":"0.0"}},"'3.5.4"]
[null,"provisions + personal effects",{"$nulls":5},"kg",null,"'3.5.4"]
[null,"drinking water",{"$nulls":5},"kg",{"$f":"K22*0.95","v":{"v":0,"d":"0.0"}},"'3.5.4"]
[null,"fuel",{"$nulls":5},"kg",{"$f":"K23*0.95","v":{"v":0,"d":"0.0"}},"'3.5.4"]
[null,"lubricating and hydraulic oils",{"$nulls":5},"kg",{"v":0,"d":"0.0"},"'3.5.4"]
[null,"black water",{"$nulls":5},"kg",{"v":0,"d":"0.0"},"'3.5.4"]
[null,"grey water",{"$nulls":5},"kg",{"v":0,"d":"0.0"},"'3.5.4"]
[null,"water ballast",{"$nulls":5},"kg",{"$f":"K27","v":{"v":0,"d":"0.0"}},"'3.5.4"]
[null,"other fluids carried aboard",{"$nulls":5},"kg",{"$f":"0.95*K28","v":{"v":0,"d":"0.0"}},"'3.5.4"]
[null,"stores, spare gear and cargo (if any)",{"$nulls":5},"kg",null,"'3.5.4"]
[null,"inflatable life raft(s) in excess of essential safety equipment",{"$nulls":5},"kg",null,"'3.5.4"]
[null,"other small boats carried aboard",{"$nulls":5},"kg",null,"'3.5.4",null,"Please be aware that for specific reasons the value 'margin for future addtions' is deleted, if necessary please add a future margin to optional equipment"]
[null,"Maximum load = sum of masses (FDIS ISO 12217-1:2020)",{"$nulls":4},"mL","kg",{"$f":"SUM(I20:I31)","v":{"v":0,"d":"0.0"}},"'3.5.4",null,"New upcoming standard version FDIS ISO 12217-2:2020 will exclude the optional equipment from the maxium load (and therefore from the maximum load for the builder's plate)"]
[null,"optional equipment and fittings not included in basic outfit",{"$nulls":5},"kg",null,"'3.5.4"]
["Maximum load = sum of above masses using ISO 12217-1:2017",{"$nulls":5},"mL","kg",{"$f":"I32+I33","v":{"v":0,"d":"0.0"}},"'3.5.4"]
["Maximum Load condition mass",{"$nulls":5},"mLDC","kg",{"$f":"I16+I34","v":{"v":0,"d":"0.0"}},"'3.5.5"]
["mass to be removed for loaded arrival condition",{"$nulls":6},"kg",null,"'3.5.6",null,"   mLA: boat in the maximum load condition minus 85 % of the maximum capacity of fixed or portable storage tanks for fuel, oils and drinking water, and minus 90 % of edible stores, but including the worst combination of optional fittings or equipment with respect to stability"]
["Loaded Arrival condition mass",{"$nulls":5},"mLA","kg",{"$f":"I35-I36","v":{"v":0,"d":"0.0"}},"'3.5.6",null,null,"maximum value:",{"$f":"I34+I16-0.85*100/95*(I22+I23+I24)","v":{"v":0,"d":"0.0"}},null,"minimum value:",{"$f":"I34+I16-0.85*100/95*(I22+I23+I24)-0.9*I21","v":{"v":0,"d":"0.0"}},"pending on mass of edible stores included in provisions + personal effects"]
["Mass of:"]
[null,"minimum number of crew according to 3.5.3",{"$nulls":5},"kg",{"$f":"IF(I10=\"\",\"\",IF(I10<=8,75,IF(I10<=16,150,IF(I10<=24,225,\"LH > 24m !\"))))","v":""},"3.5.3a)",null,"75 kg where LH ≤ 8 m, 150 kg where 8 m < LH ≤ 16 m, 225 kg where 16 m < LH ≤ 24 m"]
[null,"non-consumable stores and equipment normally aboard",{"$nulls":5},"kg",null,"3.5.3b)"]
[null,"inflatable life raft",{"$nulls":5},"kg",null,"'3.5.3"]
["Load to be included in Minimum Operating Condition",{"$nulls":5},"m'L","kg",{"$f":"SUM(I39:I41)","v":{"v":0,"d":"0.0"}},"'3.5.3"]
["Light craft condition mass",{"$nulls":5},"mLC","kg",{"$f":"I16","v":{"v":0,"d":"0.0"}},"'3.5.2"]
["Mass in the Minimum Operating Condition",{"$nulls":5},"mMO","kg",{"$f":"SUM(I42:I43)","v":{"v":0,"d":"0.0"}},"'3.5.3",null,"Maximum recommended load for builder's plate",{"$nulls":4},"(default: all tanks calculated to be fixed, if portable please click below 'portable')"]
["Maximum recommended load for builder's plate",{"$nulls":6},"kg",{"$f":"R49","v":{"v":0,"d":"0.0"}},"ISO 14945",null,"additional information:",null,null,"Please calculate maximum recommended load for builder's plate weight with the cells below. If portable please change Yes to no, portable"]
["Maximum load for the builder's plate using FDIS ISO 14946",{"$nulls":5},"mMBP","kg",{"$f":"I45-I33","v":{"v":0,"d":"0.0"}},"FDIS 14946",{"$nulls":4},"Def.: maximum recommended load for builder's plate, excluding the mass of the contents of fixed fuel and water tanks when full."]
["Is boat sail or non-sail?   nominal sail area",{"$nulls":5},"AS","m2",null,"'3.4.8"]
["sail area / displacement ratio = AS / (mLDC)2/3",{"$nulls":6}," -----",{"$f":"I47/(I35)^(2/3)","v":{"$error":"#DIV/0!"}},"3.1.2",{"$nulls":41},"SAIL"]
["CLASSIFIED AS [non-sail if AS / (mLDC)2/3 < 0.07]",{"$nulls":5},"SAIL/NON-SAIL ?",null,{"$f":"IF(I47=\"\",\"\",IF(I47/I35^(2/3)<0.07,\"NON-SAIL\",\"SAIL\"))","v":""},"3.1.2",{"$nulls":6},"maximum recommended load for builder's plate weight:",{"$f":"I34-S50-S51-S52-S53-S54-S55-S56","v":{"v":0,"d":"0.0"}},null,"according to ISO 14945",{"$nulls":31},"NON-SAIL"]
["NB If SAIL, continue using these worksheets, if NON-SAIL, use ISO 12217-1",{"$nulls":15},"water in fixed tank(s)?","Yes",{"$f":"IF(R50=\"Yes\",I22,0)","v":{"v":0,"d":"0.0"}}]
[{"$nulls":16},"fuel in fixed tank(s)?","Yes",{"$f":"IF(R51=\"Yes\",I23,0)","v":{"v":0,"d":"0.0"}},"according FDIS ISO 14945 and FDIS ISO 14946"]
[{"$nulls":16},"oils in fixed tank(s)?","Yes",{"$f":"IF(R52=\"Yes\",I24,0)","v":{"v":0,"d":"0.0"}},null,{"$f":"I32-S50-S51-S52-S53-S54-S55-S56","v":{"v":0,"d":"0.0"}}]
[{"$nulls":16},"black water in fixed tank(s)?","Yes",{"$f":"IF(R53=\"Yes\",I25,0)","v":{"v":0,"d":"0.0"}}]
[{"$nulls":16},"grey water in fixed tank(s)?","Yes",{"$f":"IF(R54=\"Yes\",I26,0)","v":{"v":0,"d":"0.0"}}]
[{"$nulls":16},"other fluids in fixed tank(s)?","Yes",{"$f":"IF(R55=\"Yes\",I28,0)","v":{"v":0,"d":"0.0"}}]
[{"$nulls":16},"water ballast in fixed tank(s)?","Yes",{"$f":"IF(R56=\"Yes\",I27,0)","v":{"v":0,"d":"0.0"}}]
[]
[]
[]
[{"$nulls":11},"FDIS 14946.2:2020 excludes from the maximum load for builder's plate weight the optional equipment !",{"$nulls":5},{"$f":"COUNTIF(R50:R56,\"Yes\")","v":7}]

{"sheet":"Worksheet 2","index":2,"n_rows":55,"n_cols":53,"rows_kept":55,"merged":[[0,11,0,12],[2,0,2,9],[2,11,2,12],[2,14,2,21],[2,22,2,29],[2,30,2,37],[2,38,2,45],[2,46,2,53],[2,54,2,61],[2,62,2,69],[2,70,2,77],[2,78,2,85],[2,86,2,93],[2,94,2,101],[2,102,2,109],[2,110,2,117],[2,118,2,125],[2,126,2,133],[2,134,2,141],[2,142,2,149],[2,150,2,157],[2,158,2,165],[2,166,2,173],[2,174,2,181],[2,182,2,189],[2,190,2,197],[2,198,2,205],[2,206,2,213],[2,214,2,221],[2,222,2,229],[2,230,2,237],[2,238,2,245],[2,246,2,253],[4,0,4,9],[6,0,6,5],[8,0,8,5],[9,0,9,9],[10,0,10,5],[11,0,11,5],[12,0,12,5],[13,0,13,5],[14,0,14,9],[15,0,15,5],[16,0,16,5],[20,0,20,1],[20,2,20,8],[21,0,21,1],[22,0,22,1],[23,0,23,1],[24,0,24,1],[25,0,25,1],[26,0,27,0],[28,0,28,1],[29,0,29,1],[30,0,30,1],[31,0,31,1],[32,0,32,1],[33,0,33,1],[34,0,34,1],[35,0,35,1],[36,0,36,1],[37,0,37,1],[38,0,38,1],[39,0,39,1],[40,0,40,1],[41,0,41,1],[43,0,43,9],[44,0,44,9],[46,0,46,9],[50,2,50,7]]}
[]
[]
["ISO 12217-2:2017    CALCULATION WORKSHEET No.2  TESTS TO BE APPLIED",{"$nulls":10},"Comments"]
[{"$nulls":12},"Derived values"]
[{"$f":"CONCATENATE(coverSheet!B5,\"          \",coverSheet!B12)","v":"          "},{"$nulls":11},"Input values"]
[]
["Question",{"$nulls":5},"Symbol","Unit","Answer","Ref."]
["Is boat fully enclosed?         (see definition in ref.)              ",{"$nulls":6},"Yes / No",null,"3.1.8",null,{"$f":"IF(I8=\"Yes\",\"please add cockpit calculation according to ISO 11812 to the stability sheets\",\"\")","v":""},{"$nulls":38},"list:"]
["Is boat a catamaran or trimaran? ",{"$nulls":6},"Yes / No",null,"3.1.3, 3.1.4",{"$nulls":40},"Yes"]
["If NO, choose from options 1 to 7.",{"$nulls":49},"No"]
["Length of hull",{"$nulls":5},"LH","m",{"$f":"'Worksheet 1'!I10","v":{"v":0,"d":"0.00"}},"3.4.1"]
["Beam of Hull",{"$nulls":5},"BH"]
["If boat is a multihull: Beam between centres of buoyancy of sidehulls",{"$nulls":5},"BCB","m",{"$f":"IF(I9=\"Yes\",\"n.a.\",\"\")","v":""},"3.4.5"]
["Is ratio LH /BCB > 5",{"$nulls":6},"Yes / No",{"$f":"IF(I9=\"Yes\",\"n.a.\",\"\")","v":""},"7.1"]
["If YES, treat the boat as a monohull, and choose from options 1 to 7. If NO, use option 8; use multihull excel calcuation template"]
["Mass in the minimum operating condition",{"$nulls":5},"mMO","kg",{"$f":"'Worksheet 1'!I44","v":0},"3.5.3"]
["Mass in the loaded arrival condition",{"$nulls":5},"mLA","kg",{"$f":"'Worksheet 1'!I37","v":0},"3.5.6"]
[]
["Choose any ONE of the following options and use all the worksheets indicated for that option."]
[]
[null,null,"All boats except catamarans and trimarans with LH / BCB > 5",{"$nulls":6},"Multih."]
["Option",null,1,2,3,4,5,6,7,8,{"$nulls":39},"xx","A1",{"$f":"CONCATENATE('Worksheet 1'!D8,'Worksheet 2'!E49)","v":""},{"$f":"COUNTIF(AY22:AY39,AZ22)","v":0}]
["categories possible",null,"A + B","C + D","C + D","C + D","C + D","C + D","C + D","A – D",{"$nulls":39},"xx","B1"]
["decking or covering",null,"fully enclosed","fully enclosed","any \namount","any \namount","any \namount","any \namount","any \namount","see note a  ",{"$nulls":39},"xx","C2"]
["downflooding openings",null,3,3,3,3,3,3,null,3,{"$nulls":39},"xx","C3"]
["downflooding angle",null,3,3,{"$nulls":45},"xx","C4"]
["downflooding \nheight test","all boats",3,3,3,null,3,null,null,3,{"$nulls":39},"xx","C5"]
[null,"full method",4,4,4,null,4,null,null,4,{"$nulls":39},"xx","C6"]
["recess size",null,"5b",{"$nulls":3},"5c","5c",null,"5d",{"$nulls":39},"xx","C7"]
["minimum energy",null,6,6,{"$nulls":45},"xx","D2"]
["angle of vanishing stability",null,6,6,{"$nulls":45},"xx","D3"]
["stability index",null,7,7,{"$nulls":45},"xx","D4"]
["knockdown-recovery test",{"$nulls":3},8,8,{"$nulls":44},"D5"]
["wind stiffness test",{"$nulls":5},9,9,{"$nulls":42},"D6"]
["flotation requirement",{"$nulls":4},10,null,10,null,"10d     ",{"$nulls":40},"D7"]
["capsize recovery test",{"$nulls":7},11,{"$nulls":41},"A8"]
["bare poles speed",{"$nulls":8},12,{"$nulls":40},"B8"]
["wind speed limits",{"$nulls":8},13,{"$nulls":40},"C8"]
["stability requirements",{"$nulls":8},14,{"$nulls":40},"D8"]
["habitable multihulls",{"$nulls":8},"14e      "]
["detection & removal of water",null,15,15,15,15,15,15,15,15]
["SUMMARY",null,16,16,16,16,16,16,16,16]
["a   Fully enclosed if category A or B, otherwise any amount."]
["b   Only applicable to boats for category B using 6.5.2 and having f V  < 90°. "]
["c   Only applicable to boats of design category C that are fully enclosed."]
["d   Applicable for category A,B and boats of design category C that are fully enclosed"]
["e   Only applicable if boat is defined as habitable according to 3.1.9, and is deemed to be vulnerable to inversion when used \n   in design category – see 7.11.2 & 7.11.3."]
[{"$nulls":51},"list:"]
[null,null,"Option selected",{"$nulls":47},{"$f":"G49","v":0},1]
[{"$nulls":50},{"$f":"CONCATENATE('Worksheet 1'!D8,'Worksheet 2'!AY49)","v":"0"},2]
[null,null,{"$f":"IF(OR($E$49=\"\",'Worksheet 1'!$D$8=\"\"),\"\",IF('Worksheet 2'!$BA$22=1,\"\",\"impossible combination of design category and option\"))","v":""},{"$nulls":48},3]
[{"$nulls":51},4]
[{"$nulls":51},5]
[{"$nulls":51},6]
[{"$nulls":51},7]

{"sheet":"Worksheet 3","index":3,"n_rows":56,"n_cols":63,"rows_kept":56,"merged":[[0,13,0,14],[2,0,2,8],[4,0,4,8],[7,0,7,6],[8,10,8,13],[17,0,17,6],[18,0,18,6],[19,0,19,6],[20,0,20,6],[21,0,21,7],[22,0,22,6],[23,0,23,6],[24,0,24,6],[25,0,25,6],[26,0,26,7],[27,0,27,6],[28,0,28,7],[32,0,32,7],[33,0,33,4],[34,0,34,4],[35,0,35,4],[36,0,36,7],[37,0,37,6],[38,0,38,4],[39,0,39,4],[40,0,40,4],[41,0,41,4],[44,0,44,4],[44,5,44,6],[44,7,44,8],[45,0,45,4],[45,5,45,6],[45,7,45,8],[46,0,46,4],[46,5,46,6],[46,7,46,8],[47,0,47,4],[47,5,47,6],[47,7,47,8],[48,0,48,4],[48,5,48,8],[49,0,52,0],[49,1,49,2],[49,5,49,6],[49,7,49,8],[50,1,50,2],[50,5,50,6],[50,7,50,8],[51,1,51,2],[51,5,51,6],[51,7,51,8],[52,1,52,2],[52,5,52,6],[52,7,52,8],[53,0,53,2],[53,3,53,4],[53,5,53,6],[53,7,53,8],[54,0,54,4],[54,5,54,6],[54,7,54,8],[55,0,55,7]]}
[{"$nulls":13},"Comments"]
[{"$nulls":14},"Derived values"]
["ISO 12217-2:2017    CALCULATION WORKSHEET No. 3   DOWNFLOODING",{"$nulls":13},"Input values"]
[]
[{"$f":"CONCATENATE(coverSheet!B5,\"          \",coverSheet!B12)","v":"          "}]
[]
["Downflooding Openings:"]
["Question",{"$nulls":6},"Answer","Ref."]
["Have all appropriate downflooding openings been identified?",{"$nulls":7},"6.2.1",null,{"$f":"IF('Worksheet 3b Overview'!A11=\"\",\"Please fill in worksheets 3a and 3b\",\"\")","v":"Please fill in worksheets 3a and 3b"},{"$nulls":40},{"$f":"IF(H9=\"Yes\",1,0)","v":0},"list:"]
["Have potential downflooding openings within the boat been identified?",{"$nulls":7},"6.2.1.4",{"$nulls":42},{"$f":"IF(H10=\"Yes\",1,0)","v":0},"Yes"]
["Do all closing appliances satisfy ISO 12216?",{"$nulls":7},"6.2.1.1",{"$nulls":42},0,"No"]
["Hatches or opening type appliances are not fitted below minimum height above waterline? *",{"$nulls":7},"6.2.1.2",{"$nulls":42},0]
["Seacocks comply with requirements?",{"$nulls":7},"6.2.1.3",{"$nulls":42},0]
["Are all openings on design category A or B boats fitted with closing appliances? **",{"$nulls":7},"6.2.1.5",{"$nulls":41},{"$f":"SUM(AZ9:AZ14)","v":0},0,null,"Abfrage nach Design Kategorie"]
["Categories possible: A or B if all are YES, C or D if first five are YES",{"$nulls":6},{"$f":"IF(AY14=6,\"A\",IF(AND(AY14=5,H14<>\"Yes\"),\"C\",\"Fail\"))","v":"Fail"},"6.2.1",{"$nulls":44},{"$f":"IF(H15=\"A\",1,IF(H15=\"C\",3))","v":false},"mögliche Kategorie downflooding"]
["* Except for emergency escape hatches on design category C boats, where 0,1 m is allowable  ** Except openings for ventilation and engine combustion",{"$nulls":52},{"$f":"IF('Worksheet 1'!D8=\"A\",1,IF('Worksheet 1'!D8=\"B\",2,IF('Worksheet 1'!D8=\"C\",3,4)))","v":4},"applied for"]
["Exemptions Downflooding Openings:"]
["Question",{"$nulls":6},"Answer","Ref.",null,"If questions are not applicable, just leave the cells empty"]
["Drains from quick-draining recesses or watertight recesses acc. to cl. 6.1.1.6 b) are either:"]
["1)   freeing ports with non-return flaps which are watertight from the exterior (degree 3)       or",{"$nulls":7},"6.2.1.6 b)",{"$nulls":42},{"$f":"IF(AND(H20=\"\",H21=\"\"),0,IF(OR(H20=\"Yes\",H21=\"Yes\"),1,10))","v":0},null,{"$f":"AZ20+AZ24+AZ28","v":0}]
["2)   have a drainage area smaller than three times the minimum area required of ISO 11812",{"$nulls":7},"6.2.1.6 b)",{"$nulls":44},{"$f":"IF(BB20=0,\"n.a.\",IF(BB20>9,\"poss. downfl.\",\"PASS\"))","v":"n.a."}]
[{"$f":"IF(AND(H20=\"\",H21=\"\"),\"\",IF(OR(H20=\"Yes\",H21=\"Yes\"),\"\",\"ATTENTION, openings to be considered as possible downflooding openings !\"))","v":""},{"$nulls":7},"6.2.1.6 b)"]
["Opening appliances (e.g. side doors) in the topsides which comply with ISO 12216 are"]
["1)   referenced in the owner’s manual as watertight closure to be kept shut when under way, and",{"$nulls":7},"6.2.1.6 d)",{"$nulls":42},{"$f":"IF(AND(H24=\"\",H25=\"\",H26=\"\"),0,IF(AND(H24=\"Yes\",H25=\"Yes\",H26=\"Yes\"),1,10))","v":0}]
["2)   marked inboard with “KEEP SHUT WHEN ...\" in upper case letters not less than 4,8 mm high, and",{"$nulls":7},"6.2.1.6 d)"]
["3)   the hight above waterline of the lowest part is > 50% of required downflooding height ",{"$nulls":7},"6.2.1.6 d)"]
[{"$f":"IF(AND(H24=\"\",H25=\"\",H26=\"\",H29=\"\"),\"\",IF(AND(H24=\"Yes\",H25=\"Yes\",H26=\"Yes\"),\"\",\"ATTENTION, openings to be considered as possible downflooding openings !\"))","v":""},{"$nulls":7},"6.2.1.6 d)"]
["All other exemtions of cl. 6.2.1.6 checked and requirements fullfilled?",{"$nulls":7},"6.2.1.6",{"$nulls":42},{"$f":"IF(H28=\"\",0,IF(H28=\"yes\",1,10))","v":0}]
[{"$f":"IF(H28=\"\",\"\",IF(H28=\"Yes\",\"\",\"ATTENTION, openings to be considered as possible downflooding openings !\"))","v":""},{"$nulls":7},"6.2.1.6"]
[]
["Downflooding angle:"]
[null,null,"Item",null,null,"Symbol","Unit","Value","Ref.",{"$nulls":44},{"$f":"IF(BB16>=BB15,\"ok\",\"fail\")","v":"fail"}]
["Required value:",{"$nulls":7},"6.2.3"]
["Cats. A + B = 40°, Cat. C = 35°, Cat. D = 30°",{"$nulls":4},"øD(R)","degrees",{"$f":"IF('Worksheet 1'!D8=\"A\",40,IF('Worksheet 1'!D8=\"B\",40,IF('Worksheet 1'!D8=\"C\",35,30)))","v":30},"Table 3"]
["Actual Downflooding Angle:  any opening  at mMO",{"$nulls":4},"øD","degrees",null,"3.3.2"]
["Actual Downflooding Angle:  any opening  at mLA",{"$nulls":4},"øD","degrees",null,"3.3.2"]
["Method used to determine øD:",{"$nulls":7},"Annex B"]
["Category possible on Downflooding Angle øD:",{"$nulls":6},{"$f":"IF(MIN(H35:H36)>H34,'Worksheet 1'!D8,\"Fail\")","v":"Fail"},"6.2.3"]
["Actual downflooding angle:   to non-quickdraining recess at mMO",{"$nulls":4},"øDC","degrees",null,"3.3.2"]
["Actual downflooding angle:   to non-quickdraining recess at mLA",{"$nulls":4},"øDC","degrees",null,"3.3.2"]
["Actual downflooding angle:   to main hatchway at mMO",{"$nulls":4},"øDH","degrees",null,"3.3.2"]
["Actual downflooding angle:   to main hatchway at mLA",{"$nulls":4},"øDH","degrees",null,"3.3.2"]
[]
["Downflooding Height:"]
["Requirement",{"$nulls":4},"Basic requirement",null,"Reduced value for small openings",{"$nulls":44},"list"]
["Applicable to",{"$nulls":4},"options 1-3, 5 and 8",null,"options 1-3,5 and 8, but only if fig. 2 is used",{"$nulls":44},"fig. 2"]
["Ref.",{"$nulls":4},"6.1.2.2 a)",null,"6.1.2.2 d)",{"$nulls":44},"annex A"]
["obtained from Fig. 2 or annex A?",{"$nulls":6}," = basic x 0.75"]
["Maximum area of small openings (50LH2) (mm2) =",{"$nulls":4},{"$f":"50*'Worksheet 1'!I10^2","v":0},{"$nulls":46},"cat C only",{"$nulls":7},"worksheet 3 abfrage gesamt"]
["Required downflooding height \nhD(R)","Fig. 2 / ann. A",null,"Category","A",{"$f":"IF('Worksheet 1'!D8=\"A\",IF(F48=\"annex A\",\"see worksheet 4\",IF(F48=\"fig. 2\",MAX(0.5,'Worksheet 1'!I10/17),\"\")),\"\")","v":""},null,{"$f":"IF(F50=\"\",\"\",IF($F$48=\"fig. 2\",F50*0.75,\"\"))","v":""},{"$nulls":49},1,"A",null,{"$f":"IF(F55=\"A\",1,IF(F55=\"B\",2,IF(F55=\"C\",3,IF(F55=\"D\",4,IF(F55=\"Fail\",99)))))","v":false},null,{"$f":"IF(H55=\"A\",1,IF(H55=\"B\",2,IF(H55=\"C\",3,IF(H55=\"D\",4,IF(H55=\"Fail\",99)))))","v":false}]
[null,"Fig. 2 / ann. A",null,"Category","B",{"$f":"IF('Worksheet 1'!D8=\"B\",IF(F48=\"annex A\",\"see worksheet 4\",IF(F48=\"fig. 2\",MAX(0.4,'Worksheet 1'!I10/17),\"\")),\"\")","v":""},null,{"$f":"IF(F51=\"\",\"\",IF($F$48=\"fig. 2\",F51*0.75,\"\"))","v":""},{"$nulls":49},2,"B"]
[null,"Fig. 2 / ann. A",null,"Category","C",{"$f":"IF('Worksheet 1'!D8=\"C\",IF(F48=\"annex A\",\"see worksheet 4\",IF(F48=\"fig. 2\",MIN(0.75,'Worksheet 1'!I10/17),\"\")),\"\")","v":""},null,"",{"$nulls":49},3,"C"]
[null,"Fig. 2 / ann. A",null,"Category","D",{"$f":"IF('Worksheet 1'!D8=\"D\",IF(F48=\"annex A\",\"see worksheet 4\",IF(F48=\"fig. 2\",MIN(0.4,'Worksheet 1'!I10/17),\"\")),\"\")","v":""},null,"",{"$nulls":49},4,"D"]
["Actual Downflooding Height hD ",null,null,"Ref. 6.2.2.1"]
["Design Category possible",{"$nulls":4},{"$f":"IF(F48=\"annex A\",'Worksheet 4'!H42,IF(F54>=MAX(F50:G53),'Worksheet 1'!D8,\"Fail\"))","v":{"v":0,"d":"0.00"}},null,{"$f":"IF(F48=\"annex A\",'Worksheet 4'!H42,IF(H54>=MAX(H50:I53),'Worksheet 1'!D8,\"Fail\"))","v":{"v":0,"d":"0.00"}},null,null,"in case of error messages like #NV or no sense entries like 0,00, please check insert design category and choosen option in worksheet one and two"]
["Design Category possible on Downflooding Height = lowest of above",{"$nulls":7},{"$f":"IF((BI50+BK50)>8,\"Fail\",F55)","v":{"v":0,"d":"0.00"}}]

{"sheet":"Worksheet 3a Overview","index":4,"n_rows":56,"n_cols":27,"rows_kept":56,"merged":[[0,13,0,14],[1,0,1,7],[3,0,3,7],[9,8,12,11],[55,0,57,6]]}
[{"$nulls":13},"Comments"]
["ISO 12217-2:2017   CALCULATION WORKSHEET No.3a   DOWNFLOODING OPENINGS / \nCLOSING APPLIANCES",{"$nulls":13},"Derived values"]
[{"$nulls":14},"Input values"]
[{"$f":"CONCATENATE(coverSheet!B5,\"          \",coverSheet!B12)","v":"          "}]
[]
["General overview downflooding openings and closing appliances",{"$nulls":25},"list"]
[]
["NOTE: All drawings are not blocked by a password, so please replace with own drawings if at hand."]
["NOTE: See X,Y, Z coordinates for worksheet 3b as illustrated below"]
[{"$nulls":8},"Please drag numbered labels to appropriate position\nPlease use same numbers only for the same opening",{"$nulls":17},"downflooding opening"]
["Top View",{"$nulls":25},"non pre-fabricated closing appliances"]
[{"$nulls":26},"pre-fabricated closing appliances"]
[{"$nulls":26},"seacock"]
[{"$nulls":26},"other devices"]
{"$rows_empty":9}
["Side View Starboard"]
{"$rows_empty":13}
["Side View Port"]
{"$rows_empty":17}
["Please insert a short describtion and measurements of downflooding openings and closing appliances under the corresponding number on worksheet 3b"]

{"sheet":"Worksheet 3b Overview","index":5,"n_rows":35,"n_cols":55,"rows_kept":35,"merged":[[0,10,0,11],[1,0,1,8],[3,0,3,8],[7,0,7,8],[9,0,9,1],[9,7,9,8],[10,0,10,1],[10,7,10,8],[11,0,11,1],[11,7,11,8],[12,0,12,1],[12,7,12,8],[13,0,13,1],[13,7,13,8],[14,0,14,1],[14,7,14,8],[15,0,15,1],[15,7,15,8],[16,0,16,1],[16,7,16,8],[17,0,17,1],[17,7,17,8],[18,0,18,1],[18,7,18,8],[19,0,19,1],[19,7,19,8],[20,0,20,1],[20,7,20,8],[21,0,21,1],[21,7,21,8],[22,0,22,1],[22,7,22,8],[23,0,23,1],[23,7,23,8],[24,0,24,1],[24,7,24,8],[25,0,25,1],[25,7,25,8],[26,0,26,1],[26,7,26,8],[27,0,27,1],[27,7,27,8],[28,0,28,1],[28,7,28,8],[29,0,29,1],[29,7,29,8],[30,0,30,1],[30,7,30,8],[31,0,31,1],[31,7,31,8],[33,0,33,8],[34,0,34,8]]}
[{"$nulls":10},"Comments"]
["ISO 12217-2:2017   CALCULATION WORKSHEET No.3b   DOWNFLOODING OPENINGS",{"$nulls":10},"Derived values"]
[{"$nulls":11},"Input values"]
[{"$f":"CONCATENATE(coverSheet!B5,\"          \",coverSheet!B12)","v":"          "}]
[]
["General overview downflooding openings and closing appliances",{"$nulls":26},"list"]
[]
["NOTE: Please submit for every pre-fabricated closing appliance a declaration of conformity (DoC) of the product. \nPlease submit for every non pre-fabricated closing appliance a calculation acc. to ISO 12216 (see IMCI template). \nFor both a watertightness test must be done!"]
[]
["Description of the downflooding opening / \nclosing appliance",null,"Nr.","X(a)\n[m]","Y\n[m]","Z (=hD)\n[m]","watertighness test done?","opening type(b)",{"$nulls":19},"downflooding opening",{"$nulls":25},"number closing appliance",{"$f":"COUNTIF(H11:I32,\"non pre-fabricated closing appliances\")+COUNTIF(H11:I32,\"pre-fabricated closing appliances\")","v":0}]
[null,null,1,{"$nulls":7},"if necessary please submit a picture or a technical drawing of the opening or closing appliance ",{"$nulls":16},"non pre-fabricated closing appliances",{"$nulls":25},"free cells downflooding openings",{"$f":"COUNTIF(A11:A32,\"\")","v":22}]
[null,null,2,{"$nulls":24},"pre-fabricated closing appliances",{"$nulls":25},"number cells watertightness test passed",{"$f":"COUNTIF(G11:G32,\"test passed\")","v":0}]
[null,null,3,{"$nulls":24},"other devices",{"$nulls":25},"Check watertightness",{"$f":"IF(BC12>22-BC11,\"wrong entry\",IF(BC11=22,\"n.a.\",IF(BC12=BC10,\"Pass\",\"Fail\")))","v":"n.a."}]
[null,null,4]
[null,null,5]
[null,null,6]
[null,null,7]
[null,null,8]
[null,null,9]
[null,null,10]
[null,null,11]
[null,null,12]
[null,null,13]
[null,null,14]
[null,null,15]
[null,null,16]
[null,null,17]
[null,null,18]
[null,null,19]
[null,null,20]
[null,null,21]
[null,null,22]
[]
["(a) Please be aware that X is measured from the aft end of LH. \nIn Annex A calculations xD is measured from the bow or stern, whichever is nearest"]
["(b) opening typs are: normal downflooding openings without any opening appliances; pre-fabricated opening appliances; non-pre-fabricated opening appliances and other devices"]

{"sheet":"Worksheet 4","index":6,"n_rows":42,"n_cols":57,"rows_kept":42,"merged":[[0,13,0,14],[2,0,2,7],[4,0,4,7],[8,0,8,1],[10,0,10,1],[11,0,11,1],[12,0,12,1],[14,0,14,1],[17,2,18,2],[17,3,18,3],[17,4,18,4],[17,5,18,5],[17,6,18,6],[17,7,18,7],[20,0,20,1],[21,0,21,1],[21,4,21,7],[22,0,22,1],[24,2,26,2],[24,3,26,3],[24,4,26,4],[24,5,26,5],[24,6,26,6],[24,7,26,7],[28,4,28,7],[29,4,29,7],[30,4,30,7],[32,2,33,2],[32,3,33,3],[32,4,33,7],[35,0,38,0]]}
[{"$nulls":13},"Comments"]
[{"$nulls":14},"Derived values"]
["ISO 12217-2:2017      CALCULATION WORKSHEET No.4     DOWNFLOODING HEIGHT",{"$nulls":13},"Input values"]
[]
[{"$f":"CONCATENATE(coverSheet!B5,\"          \",coverSheet!B12)","v":"          "}]
[]
["Calculation using normativ annex A (options 1-3 and 5 only)"]
[]
["Item",null,"Symbol","Unit","Opening \n1","Opening \n2","Opening \n3","Opening \n4"]
["Position of openings"]
["Least longitudinal distance from bow/stern",null,"xD","m"]
["Least travers distance from gunwale",null,"yD","m"]
["F1 = greater of (1 - xD / LH) or (1 - yD / BH) ",null,"F1"," ----",{"$f":"IF(E11=\"\",1,MAX(1-E12/'Worksheet 2'!$I$12,1-E11/'Worksheet 1'!$I$10,0.5))","v":{"v":1,"d":"1.00"}},{"$f":"IF(F11=\"\",1,MAX(1-F12/'Worksheet 2'!$I$12,1-F11/'Worksheet 1'!$I$10,0.5))","v":{"v":1,"d":"1.00"}},{"$f":"IF(G11=\"\",1,MAX(1-G12/'Worksheet 2'!$I$12,1-G11/'Worksheet 1'!$I$10,0.5))","v":{"v":1,"d":"1.00"}},{"$f":"IF(H11=\"\",1,MAX(1-H12/'Worksheet 2'!$I$12,1-H11/'Worksheet 1'!$I$10,0.5))","v":{"v":1,"d":"1.00"}}]
["Size of openings:"]
["Combined area of openings to top of any down-flooding opening",null,"a","mm2"]
["Longitudinal distance of opening from tip of bow",null,"x'D","m"]
["Limiting value of a = (30LH)2",null,null,"mm2",{"$f":"(30*'Worksheet 1'!I10)^2","v":0},{"$f":"(30*'Worksheet 1'!I10)^2","v":0},{"$f":"(30*'Worksheet 1'!I10)^2","v":0},{"$f":"(30*'Worksheet 1'!I10)^2","v":0}]
["If a ≥ (30LH)2, F2 = 1,0",null,"F2"," ----",{"$f":"IF(E15=\"\",1,IF(E15>E17,1,1+E16/'Worksheet 1'!$I$10*(SQRT('Worksheet 4'!E15)/75/'Worksheet 1'!$I$10-0.4)))","v":{"v":1,"d":"1.00"}},{"$f":"IF(F15=\"\",1,IF(F15>F17,1,1+F16/'Worksheet 1'!$I$10*(SQRT('Worksheet 4'!F15)/75/'Worksheet 1'!$I$10-0.4)))","v":{"v":1,"d":"1.00"}},{"$f":"IF(G15=\"\",1,IF(G15>G17,1,1+G16/'Worksheet 1'!$I$10*(SQRT('Worksheet 4'!G15)/75/'Worksheet 1'!$I$10-0.4)))","v":{"v":1,"d":"1.00"}},{"$f":"IF(H15=\"\",1,IF(H15>H17,1,1+H16/'Worksheet 1'!$I$10*(SQRT('Worksheet 4'!H15)/75/'Worksheet 1'!$I$10-0.4)))","v":{"v":1,"d":"1.00"}}]
["      If a < (30LH)2, F2 = "]
["Size of recesses:"]
["Volume of recesses which are not self-draining in accordance with ISO 11812",null,"VR","m3"]
["Freeboard amidships (see 3.4.6)",null,"FM","m"]
["Is opening not a recess? Is recess quickdraining? Is recess not quickdraining?",{"$nulls":50},"list:","opening not a recess"]
["k = VR/(LHBHFM)",null,"k"," ----",{"$f":"IF(OR(E21=\"\",$E$22=\"\"),\"\",E21/'Worksheet 2'!$I$11/'Worksheet 2'!$I$12/$E$22)","v":""},{"$f":"IF(OR(F21=\"\",$E$22=\"\"),\"\",F21/'Worksheet 2'!$I$11/'Worksheet 2'!$I$12/$E$22)","v":""},{"$f":"IF(OR(G21=\"\",$E$22=\"\"),\"\",G21/'Worksheet 2'!$I$11/'Worksheet 2'!$I$12/$E$22)","v":""},{"$f":"IF(OR(H21=\"\",$E$22=\"\"),\"\",H21/'Worksheet 2'!$I$11/'Worksheet 2'!$I$12/$E$22)","v":""},{"$nulls":44},"quick- draining"]
["If opening is not a recess,","F3 = 1","F3"," ----",{"$f":"IF(E23=\"quick- draining\",0.7,IF(E23=\"not quick- draining\",MIN(1.2,0.7+E24^0.5),IF(E23=\"\",1.2,1)))","v":{"v":1.2,"d":"1.20"}},{"$f":"IF(F23=\"quick- draining\",0.7,IF(F23=\"not quick- draining\",MIN(1.2,0.7+F24^0.5),IF(F23=\"\",1.2,1)))","v":{"v":1.2,"d":"1.20"}},{"$f":"IF(G23=\"quick- draining\",0.7,IF(G23=\"not quick- draining\",MIN(1.2,0.7+G24^0.5),IF(G23=\"\",1.2,1)))","v":{"v":1.2,"d":"1.20"}},{"v":1.2,"d":"1.20"},{"$nulls":44},"not quick- draining"]
["If recess is quickdraining,     ","F3 = 0.7"]
["If recess is not quick draining,","F3 = (0.7 + k0.5)",{"$nulls":11},"F3 is the recess size factor, greater than 0,7 but never to be taken as greater than 1,2:\n\n "]
["Displacement:"]
["Loaded displacement volume (see 3.5.7)",null,"VD","m3",{"$f":"'Worksheet 1'!I35/1025","v":{"v":0,"d":"0.00"}}]
["B = BH for monohulls",null,"B","m",{"$f":"'Worksheet 2'!I12","v":0}]
["F4 = [(10 VD)/(LH B2)]1/3",null,"F4"," ----",{"$f":"(10*E29/('Worksheet 1'!I10*'Worksheet 4'!E30*'Worksheet 4'!E30))^(1/3)","v":{"$error":"#DIV/0!"}}]
["Flotation:"]
["For boats using option 4 or 6, F5 = 0.8",null,"F5"," ----",{"$f":"IF('Worksheet 2'!E49=4,0.8,IF('Worksheet 2'!E49=6,0.8,1))","v":1}]
["For all other boats,                F5 = 1.0",{"$nulls":51},"sAbfragetabelle"]
["Required calculation height: = F1F2F3F4F5LH/15",null,"hD(R)","m",{"$f":"IF(OR('Worksheet 1'!$D$8=\"A\",'Worksheet 1'!$D$8=\"B\"),MIN(E13*E18*E25*$E$31*$E$33*'Worksheet 1'!$I$10/15,1.41),IF('Worksheet 1'!$D$8=\"C\",MIN(E13*E18*E25*$E$31*$E$33*'Worksheet 1'!$I$10/15,0.75),IF('Worksheet 1'!$D$8=\"D\",MIN(E13*E18*E25*$E$31*$E$33*'Worksheet 1'!$I$10/15,0.4),\"\")))","v":""},{"$f":"IF(OR('Worksheet 1'!$D$8=\"A\",'Worksheet 1'!$D$8=\"B\"),MIN(F13*F18*F25*$E$31*$E$33*'Worksheet 1'!$I$10/15,1.41),IF('Worksheet 1'!$D$8=\"C\",MIN(F13*F18*F25*$E$31*$E$33*'Worksheet 1'!$I$10/15,0.75),IF('Worksheet 1'!$D$8=\"D\",MIN(F13*F18*F25*$E$31*$E$33*'Worksheet 1'!$I$10/15,0.4),\"\")))","v":""},{"$f":"IF(OR('Worksheet 1'!$D$8=\"A\",'Worksheet 1'!$D$8=\"B\"),MIN(G13*G18*G25*$E$31*$E$33*'Worksheet 1'!$I$10/15,1.41),IF('Worksheet 1'!$D$8=\"C\",MIN(G13*G18*G25*$E$31*$E$33*'Worksheet 1'!$I$10/15,0.75),IF('Worksheet 1'!$D$8=\"D\",MIN(G13*G18*G25*$E$31*$E$33*'Worksheet 1'!$I$10/15,0.4),\"\")))","v":""},{"$f":"IF(OR('Worksheet 1'!$D$8=\"A\",'Worksheet 1'!$D$8=\"B\"),MIN(H13*H18*H25*$E$31*$E$33*'Worksheet 1'!$I$10/15,1.41),IF('Worksheet 1'!$D$8=\"C\",MIN(H13*H18*H25*$E$31*$E$33*'Worksheet 1'!$I$10/15,0.75),IF('Worksheet 1'!$D$8=\"D\",MIN(H13*H18*H25*$E$31*$E$33*'Worksheet 1'!$I$10/15,0.4),\"\")))","v":""},null,"limited to max value row 2 table A.1",{"$nulls":3},"Table A.1 — Limits on required downflooding height",{"$nulls":38},"Table A.1 — Limits on required downflooding height"]
["Required downfooding height with limits applied\n(see annex A, Table A.1)","Category A","hD(R)","m",{"$f":"IF('Worksheet 1'!$D$8=\"A\",0.5,\"\")","v":""},{"$f":"IF('Worksheet 1'!$D$8=\"A\",0.5,\"\")","v":""},{"$f":"IF('Worksheet 1'!$D$8=\"A\",0.5,\"\")","v":""},{"$f":"IF('Worksheet 1'!$D$8=\"A\",0.5,\"\")","v":""},{"$nulls":5},"Design category","A","B","C","D",{"$nulls":32},{"$f":"MAX(E35:E39)","v":{"v":0,"d":"0.00"}},null,"Design category","A","B","C","D"]
[null,"Category B","hD(R)","m",{"$f":"IF('Worksheet 1'!$D$8=\"B\",0.4,\"\")","v":""},{"$f":"IF('Worksheet 1'!$D$8=\"B\",0.4,\"\")","v":""},{"$f":"IF('Worksheet 1'!$D$8=\"B\",0.4,\"\")","v":""},{"$f":"IF('Worksheet 1'!$D$8=\"B\",0.4,\"\")","v":""}]
[null,"Category C","hD(R)","m",{"$f":"IF('Worksheet 1'!$D$8=\"C\",0.3,\"\")","v":""},{"$f":"IF('Worksheet 1'!$D$8=\"C\",0.3,\"\")","v":""},{"$f":"IF('Worksheet 1'!$D$8=\"C\",0.3,\"\")","v":""},{"$f":"IF('Worksheet 1'!$D$8=\"C\",0.3,\"\")","v":""},{"$nulls":5},"hD(R)shall be not less than",0.5,0.4,0.3,0.2,{"$nulls":34},"hD(R)shall be not less than",0.5,0.4,0.4,0.3]
[null,"Category D","hD(R)","m",{"$f":"IF('Worksheet 1'!$D$8=\"D\",0.2,\"\")","v":""},{"$f":"IF('Worksheet 1'!$D$8=\"D\",0.2,\"\")","v":""},{"$f":"IF('Worksheet 1'!$D$8=\"D\",0.2,\"\")","v":""},{"$f":"IF('Worksheet 1'!$D$8=\"D\",0.2,\"\")","v":""},{"$nulls":5},"hD(R)shall be not more than",1.41,1.41,0.75,0.4,{"$nulls":34},"hD(R)shall be not more than",1.41,1.41,1.41,0.75]
["Measured Downflooding Height:",null,"hD","m"]
[{"$nulls":3},"Design Category possible:",{"$f":"IF(E40=\"\",\"\",IF(E40>MAX(E35:E39),'Worksheet 1'!$D$8,\"Fail\"))","v":""},{"$f":"IF(F40=\"\",\"\",IF(F40>MAX(F35:F39),'Worksheet 1'!$D$8,\"Fail\"))","v":""},{"$f":"IF(G40=\"\",\"\",IF(G40>MAX(G35:G39),'Worksheet 1'!$D$8,\"Fail\"))","v":""},{"$f":"IF(H40=\"\",\"\",IF(H40>MAX(H35:H39),'Worksheet 1'!$D$8,\"Fail\"))","v":""}]
[{"$nulls":6},"Lowest of above = ",{"$f":"IF(BA42>0,\"Fail\",'Worksheet 1'!D8)","v":"Fail"},{"$nulls":44},{"$f":"IF(E40=\"\",\"\",COUNTIF(E41:H41,\"Fail\"))","v":""}]

{"sheet":"Worksheet 5","index":7,"n_rows":93,"n_cols":53,"rows_kept":93,"merged":[[0,8,0,9],[2,0,2,6],[4,0,4,6],[6,2,6,6],[9,0,9,1],[9,2,9,3],[9,4,9,5],[10,0,11,1],[10,2,11,3],[10,4,11,5],[10,6,11,6],[12,0,13,1],[12,2,13,3],[12,4,13,5],[12,6,13,6],[14,0,14,1],[14,2,14,3],[14,4,14,5],[15,2,15,3],[15,4,15,5],[16,0,16,1],[16,2,16,3],[16,4,16,5],[17,0,17,1],[17,2,18,3],[17,4,18,5],[17,6,18,6],[18,0,18,1],[19,0,19,1],[19,2,19,3],[19,4,19,5],[20,0,20,1],[20,2,20,3],[20,4,20,5],[21,0,21,1],[21,2,21,3],[21,4,21,5],[23,1,23,3],[27,0,28,0],[27,1,28,1],[27,2,28,3],[27,4,27,5],[27,6,28,6],[28,4,28,5],[29,0,29,6],[30,2,30,3],[30,4,30,5],[31,2,31,3],[31,4,31,5],[32,2,32,3],[32,4,32,5],[33,2,33,3],[33,4,33,5],[34,2,34,3],[34,4,34,5],[35,2,35,3],[35,4,35,5],[36,2,36,3],[36,4,36,5],[36,52,37,52],[38,0,38,6],[38,8,38,16],[38,52,39,52],[39,8,39,16],[40,52,41,52],[54,1,55,1],[54,2,55,3],[54,4,54,5],[54,6,55,6],[55,4,55,5],[56,1,57,1],[56,2,57,3],[56,4,57,5],[56,6,57,6],[58,0,58,2],[58,3,59,3],[58,4,59,5],[58,6,59,6],[59,0,59,2],[60,0,60,2],[60,3,61,3],[60,4,61,5],[60,6,61,6],[61,0,61,2],[62,0,62,2],[62,3,63,3],[62,4,63,5],[62,6,63,6],[63,0,63,2],[65,0,65,3],[65,4,65,5],[66,0,66,3],[66,4,66,5],[67,1,67,2],[67,4,67,5],[68,1,68,2],[68,4,68,5],[69,0,69,3],[69,4,71,5],[69,6,71,6],[70,0,70,3],[71,0,71,3],[72,0,72,3],[72,4,72,5],[73,1,73,2],[73,4,73,5],[74,1,74,2],[74,4,74,5],[75,0,75,3],[75,4,77,5],[75,6,77,6],[76,0,76,3],[77,0,77,3],[78,0,78,3],[78,4,78,5],[79,0,79,1],[79,2,80,2],[79,3,80,3],[79,4,80,5],[79,6,80,6],[80,0,80,1],[81,0,81,1],[81,2,82,2],[81,3,82,3],[81,4,82,5],[81,6,82,6],[82,0,82,1],[83,0,84,3],[83,4,84,5],[83,6,84,6],[86,0,86,3],[86,4,86,5],[88,0,88,3],[88,4,88,5],[89,0,89,3],[89,4,89,5],[90,0,90,2],[90,4,90,5],[91,0,91,2],[91,4,91,5],[92,0,92,3],[92,4,92,5]]}
[{"$nulls":8},"Comments"]
[{"$nulls":9},"Derived values"]
["ISO 12217-2:2017  CALCULATION WORKSHEET No. 5        RECESS SIZE                              ",{"$nulls":8},"Input values"]
[]
[{"$f":"CONCATENATE(coverSheet!B5,\"          \",coverSheet!B12)","v":"          "}]
[]
["NB: This sheet is to be completed for the Loaded Arrival Condition.",null,{"$f":"IF('Worksheet 2'!E49=\"\",\"\",IF(AND(OR('Worksheet 2'!E49=5,'Worksheet 2'!E49=6),'Worksheet 2'!I8=\"yes\"),\"calculation required\",IF(AND('Worksheet 2'!E49=1,'Worksheet 6'!F21=\"yes\"),\"calculation required\",\"calculation not applicable\")))","v":""},{"$nulls":5},"for option 1: Only applicable to boats using 6.5.2 and having ϕV < 90°"]
[{"$nulls":8},"for option 5,6: This requirement only applies to boats of design category C that are fully enclosed."]
["Further exemptions according to 6.5.1"]
["Angle of vanishing stability > 90° ?                                               ",null,"YES/NO",{"$nulls":3},"6.3.1a)",{"$nulls":45},"list:"]
["Over at least 35% of the periphery is the depth of the recess less than 3% of the max. breadth of the recess (e.g. toe rails, low bulwarks)",null,"YES/NO",{"$nulls":3},"6.3.1b)",{"$nulls":45},"Yes"]
[{"$nulls":52},"Yes"]
["At least 5% of the bulwark area positioned within the lowest 25% of the bulwark height drains overboard and the bulwark height is less than 12,5% of the  maximum breadth of the recess\n(attention, req. 1) and 2) below must get also a \"Yes\" to fullfill all requirements)",null,"YES/NO",{"$nulls":3},"6.3.1c)",{"$nulls":45},"No"]
[]
["Unobstructed drainage area from the recess on each side of the boat centreline",null,"m²",{"$nulls":3},"6.3.1d)"]
["Volume of the recess to the recess retention level",null,"m³"]
["Drainage area per side (m²) divided by recess volume (m³)",{"$nulls":3},{"$f":"IF(OR(E15=\"\",E16=\"\"),\"\",E15/E16)","v":""},null,"6.3.1d)",null,"meets requirements if result is >",null,"0,09 where the drainage openings are within the lowest 25 % of the recess depth"]
["Height position of drainage area ",{"$nulls":5},"6.3.1d)",{"$nulls":3},"0,16 where the drainage openings are within the lowest 50 % of the recess depth"]
["(lowest 25% / lowest 50% / full depth)",{"$nulls":9},"0,30 where the drainage openings are the full depth of the recess",{"$nulls":41},"lowest 25%"]
["Requirements of 6.3.1.d) fullfilled? (attention, req. 1) and 2) below must get also a \"Yes\")",null,"YES/NO",null,{"$f":"IF(E17=\"\",\"\",IF(AND(E18=\"lowest 25%\",E17>0.09),\"yes\",IF(AND(E18=\"lowest 50%\",E17>0.16),\"Yes\",IF(AND(E18=\"full depth\",E17>0.3),\"Yes\",\"No\"))))","v":""},null,"6.3.1d)",null,"AND if req 1) and req 2) of 6.3.1 are fulfilled",{"$nulls":43},"lowest 50%"]
["1) the lower edge of the drainage openings are not more than 10 mm above recess sole\nheight for at least 70 % of the width of each opening?",null,"YES/NO",{"$nulls":3},"6.3.1 c) & d)",{"$nulls":45},"full depth"]
["2) If drainage area is provided by an open or partially open transom, are the openings extend to the outboard sides of the recess sole on both sides?",null,"YES/NO",{"$nulls":3},"6.3.1 c) & d)"]
[]
["Is recess exempt from size limit?     If \"yes\", no further calculation required.",{"$f":"IF(C7=\"\",\"\",IF(C7=\"calculation not applicable\",\"\",IF(OR(E10=\"Yes\",E11=\"Yes\",AND(E13=\"Yes\",E21=\"Yes\",E22=\"Yes\"),AND(E20=\"Yes\",E21=\"Yes\",E22=\"Yes\")),\"Yes\",\"calculation required\")))","v":""},{"$nulls":4},"6.3.1"]
[]
[]
["Calculation methods:"]
["Item","Symbol","Unit",null,"Value",null,"Ref."]
[{"$nulls":4},{"$f":"CONCATENATE(E9,F9)","v":""}]
["SIMPLIFIED METHOD: Use 1), 2) or 3) below."]
["Average freeboard to loaded waterline at aft end of recess","FA","m",{"$nulls":3},"6.3.2.1"]
["Average freeboard to loaded waterline at sides of recess","FS","m",{"$nulls":3},"6.3.2.1"]
["Average freeboard to loaded waterline at forward end of recess","FF","m",{"$nulls":3},"6.3.2.1"]
["Waterline length at mLA","LWL","m"]
["Waterline breadth at mLA","BWL","m"]
["Maximum length of recess at the retention level (see 3.5.11)","l","m",{"$nulls":3},"6.3.2.4"]
["Maximum breadth of recess at the retention level (see 3.5.11)","b","m",{"$nulls":3},"6.3.2.4",{"$nulls":45},"A"]
[]
[" - In case of assymetric recesses (e.g. bowrider, centercockpits,….), please insert length and breadth of each area below; this allows a more exact calculation using simplified method 1) or 2)",{"$nulls":7},"In case of assymetric recesses (see example) calculating with max beam and max length of the recess is giving adverse results.",{"$nulls":43},"B"]
[null,"max. length","max. breadth","Unit","% loss GMT\n(option 1)","% loss GMT\n(option 2)","Ref.",null,"In this case using method 1) or 2) one can calculate the calculated percentage loss in metacentric height for every single part of the recess and add the results. Please be aware that this way of calculation is NOT possible for method 3) !"]
["Maximum length and breadth of recess part A",null,null,"m",{"$f":"IF($E$69=\"\",\"\",IF(B41=\"\",\"\",IF(C41=\"\",\"\",102500*B41*C41^3/12/$E$69/'Worksheet 1'!$I$37)))","v":""},{"$f":"IF(OR(B41=\"\",C41=\"\"),\"\",(B41*C41^3/12)*245/$E$75)","v":""},"6.3.2.2/3",{"$nulls":45},"C"]
["Maximum length and breadth of recess part B",null,null,"m",{"$f":"IF($E$69=\"\",\"\",IF(B42=\"\",\"\",IF(C42=\"\",\"\",102500*B42*C42^3/12/$E$69/'Worksheet 1'!$I$37)))","v":""},{"$f":"IF(OR(B42=\"\",C42=\"\"),\"\",(B42*C42^3/12)*245/$E$75)","v":""},"6.3.2.2/3"]
["Maximum length and breadth of recess part C",null,null,"m",{"$f":"IF($E$69=\"\",\"\",IF(B43=\"\",\"\",IF(C43=\"\",\"\",102500*B43*C43^3/12/$E$69/'Worksheet 1'!$I$37)))","v":""},"","6.3.2.2/3"]
["Maximum length and breadth of recess part D",null,null,"m",{"$f":"IF($E$69=\"\",\"\",IF(B44=\"\",\"\",IF(C44=\"\",\"\",102500*B44*C44^3/12/$E$69/'Worksheet 1'!$I$37)))","v":""},"","6.3.2.2/3"]
["Maximum length and breadth of recess part E",null,null,"m",{"$f":"IF($E$69=\"\",\"\",IF(B45=\"\",\"\",IF(C45=\"\",\"\",102500*B45*C45^3/12/$E$69/'Worksheet 1'!$I$37)))","v":""},"","6.3.2.2/3"]
["Maximum length and breadth of recess part F",null,null,"m",{"$f":"IF($E$69=\"\",\"\",IF(B46=\"\",\"\",IF(C46=\"\",\"\",102500*B46*C46^3/12/$E$69/'Worksheet 1'!$I$37)))","v":""},"","6.3.2.2/3"]
["Maximum length and breadth of recess part G",null,null,"m",{"$f":"IF($E$69=\"\",\"\",IF(B47=\"\",\"\",IF(C47=\"\",\"\",102500*B47*C47^3/12/$E$69/'Worksheet 1'!$I$37)))","v":""},"","6.3.2.2/3"]
["Maximum length and breadth of recess part H",null,null,"m",{"$f":"IF($E$69=\"\",\"\",IF(B48=\"\",\"\",IF(C48=\"\",\"\",102500*B48*C48^3/12/$E$69/'Worksheet 1'!$I$37)))","v":""},"","6.3.2.2/3"]
["Maximum length and breadth of recess part I",null,null,"m",{"$f":"IF($E$69=\"\",\"\",IF(B49=\"\",\"\",IF(C49=\"\",\"\",102500*B49*C49^3/12/$E$69/'Worksheet 1'!$I$37)))","v":""},"","6.3.2.2/3",null,"e.g. simplified recess areas (with side decks, …)"]
["to be continued on page 2"]
[]
[]
[]
["page 2"]
[null,"Symbol","Unit",null,"Value",null,"Ref."]
[{"$nulls":4},{"$f":"CONCATENATE(E9,F9)","v":""}]
["Average freeboard to recess periphery ","FR","m",null,{"$f":"(E31+E32*2+E33)/4","v":0},null,"6.3.2.1"]
["= (FA + 2FS + FF) / 4"]
["Category A permitted percentage loss in metacentric height ",{"$nulls":3},{"$f":"IF('Worksheet 1'!D8=\"A\",250*E57/'Worksheet 1'!I10,\"n.a.\")","v":"n.a."},null,"6.3.2.1"]
["(GMT) = 250 FR / LH"]
["Category B permitted percentage loss in metacentric height ",{"$nulls":3},{"$f":"IF('Worksheet 1'!D8=\"B\",550*E57/'Worksheet 1'!I10,\"n.a.\")","v":"n.a."},null,"6.3.2.1"]
["(GMT) = 550 FR / LH"]
["Category C permitted percentage loss in metacentric height ",{"$nulls":3},{"$f":"IF('Worksheet 1'!D8=\"C\",1200*E57/'Worksheet 1'!I10,\"n.a.\")","v":"n.a."},null,"6.3.2.1"]
["(GMT) = 1 200 FR / LH"]
[]
["SIMPLIFIED METHOD: Use 1), 2) or 3) below.",{"$nulls":3},{"$f":"CONCATENATE(E9,F9)","v":""}]
["1) Loss of GMT used?    ",{"$nulls":5},"6.3.2.2"]
["Second moment of area of free-surface of recess ","SMARECESS",null,"m4",{"$f":"IF(AND(B41<>\"\",C41<>\"\"),\"Calc of different areas\",E80*E82^3/12)","v":0},null,"6.3.2.2"]
["Metacentric height of boat at mLA","GMT",null,"m",null,null,"6.3.2.2",null,"SMARECESS = l * b³ / 12",null,null,"theor.:"]
[{"$nulls":4},{"$f":"IF(AND(B41<>\"\",C41<>\"\"),SUM(E41:E49),IF(E69=\"\",\"\",IF(E80=\"\",\"\",IF(E82=\"\",\"\",102500*E68/E69/'Worksheet 1'!I37))))","v":""},null,"6.3.2.2"]
["Calculated percentage loss in metacentric height                                                (GMT) = "]
[]
["2) Second moment of areas used?         ",{"$nulls":5},"6.3.2.3"]
["Second moment of area of free-surface of recess ","SMARECESS",null,"m4",{"$f":"IF(AND(B41<>\"\",C41<>\"\"),\"Calc of different areas\",E80*E82^3/12)","v":0},null,"6.3.2.3"]
["Second moment of area of waterplane of boat at mLA","SMAWP",null,"m4",{"$f":"E34*E35^3/M77","v":0},null,"6.3.2.3"]
[{"$nulls":4},{"$f":"IF(OR(E34=\"\",E35=\"\"),\"\",IF(AND(B41<>\"\",C41<>\"\"),SUM(F41:F49),IF(E36=\"\",\"\",IF(E37=\"\",\"\",245*E74/E75))))","v":""},null,"6.3.2.3",null,"SMAWP = LWL * BWL³ / k",null,null,"where k is between 18 and 24 for sailing yachts"]
["Calculated percentage loss in metacentric height                                            (GMT) = ",{"$nulls":10},"k = ",24,"default value 24, please insert exact value from your hydrostatic programm"]
[{"$nulls":12},"Coefficient","k"]
["3) Recess dimensions used?   ",{"$nulls":5},"6.3.2.4",{"$nulls":5},1,12,{"$f":"M79/12","v":{"v":0.08333333333333333,"d":"0.083"}}]
["Maximum length of recess at the retention level ",null,"l","m",{"$f":"E36","v":0},null,"6.3.2.4",{"$nulls":5},0.9,{"$f":"1/O80","v":{"v":13.333333333333334,"d":"13.33"}},{"$f":"M80/12","v":0.075}]
["(see 3.6.11)",{"$nulls":11},0.8,{"v":15,"d":"15.00"},{"$f":"M81/12","v":{"v":0.06666666666666667,"d":"0.067"}}]
["Maximum breadth of recess at the retention level ",null,"b","m",{"$f":"E37","v":0},null,"6.3.2.4",{"$nulls":5},0.7,{"v":17.142857142857146,"d":"17.14"},{"v":0.05833333333333333,"d":"0.058"},null,null,"b"]
["(see 3.6.11)",{"$nulls":11},0.6,{"$f":"1/O83","v":{"v":20,"d":"20.00"}},{"v":0.049999999999999996,"d":"0.050"}]
["Calculated percentage loss in metacentric height                                                        (GMT) = ",{"$nulls":3},{"$f":"IF(OR(E36=\"\",E37=\"\"),\"\",IF('Worksheet 1'!I10=\"\",\"\",IF('Worksheet 2'!I12=\"\",\"\",270*(E80*E82^3/'Worksheet 1'!I10/'Worksheet 2'!I12^3)^0.7)))","v":""},null,"6.3.2.4",{"$nulls":5},0.5,{"v":24,"d":"24.00"},{"v":0.041666666666666664,"d":"0.042"}]
[{"$nulls":12},0.4,{"v":30,"d":"30.00"},{"$f":"M85/12","v":{"v":0.03333333333333333,"d":"0.033"}}]
[{"$nulls":15},"l"]
["Requirement: from results above, applied design category possible?",{"$nulls":3},{"$f":"IF(OR(C7=\"\",C7=\"calculation not applicable\",B24=\"Yes\"),\"n.a.\",IF(OR(E84<MAX(E59:F64),E76<MAX(E59:F64),E70<MAX(E59:F64)),\"Yes\",\"Fail\"))","v":"n.a."},null,"6.3.2.1"]
[]
["DIRECT CALCULATION METHOD used? ",{"$nulls":5},"6.3.3"]
["percentage full of water = 60 – 240 F/LH",{"$nulls":3},{"$f":"IF('Worksheet 1'!I10=\"\",\"\",IF(E31=\"\",\"\",60-240*MIN(E31:F33)/'Worksheet 1'!I10))","v":""},null,"6.3.3a)",{"$nulls":10},"b"]
["actual residual righting moment up to ϕD, ϕV or 90° whichever is least",null,null,"N∙m",null,null,"6.3.3b)"]
["required residual righting moment up to ϕD, ϕV or 90° whichever is least",null,null,"N∙m",{"$f":"IF('Worksheet 1'!D8=\"A\",3.6*'Worksheet 1'!I37,IF('Worksheet 1'!D8=\"B\",2.6*'Worksheet 1'!I37,2.1*'Worksheet 1'!I37))","v":0},null,"6.3.3b)"]
["design category possible ",{"$nulls":3},{"$f":"IF(E91>E92,'Worksheet 1'!D8,\"Fail\")","v":"Fail"},{"$nulls":10},"l"]

{"sheet":"Worksheet 6","index":8,"n_rows":34,"n_cols":27,"rows_kept":34,"merged":[[0,7,0,8],[2,0,2,5],[4,0,4,5],[7,3,7,4],[8,3,8,4],[9,3,9,4],[10,3,10,4],[11,0,11,4],[12,0,12,2],[12,3,12,4],[18,0,18,2],[20,3,20,4],[25,0,25,1],[26,3,26,4],[27,3,27,4],[28,0,28,1],[28,3,28,4],[29,0,29,1],[29,3,29,4],[30,0,30,1],[30,3,30,4],[31,0,31,1],[31,3,31,4],[32,0,32,1],[32,3,32,4],[33,0,33,2],[33,3,33,4]]}
[{"$nulls":7},"Comments"]
[{"$nulls":8},"Derived values"]
["ISO 12217-2:2017   CALCULATION  WORKSHEET  No. 6                         MINIMUM RIGHTING ENERGY\n & ANGLE OF VANISHING STABILITY",{"$nulls":7},"Input values"]
[{"$nulls":26},"list:"]
[{"$f":"CONCATENATE(coverSheet!B5,\"          \",coverSheet!B12)","v":"          "},{"$nulls":25},"Yes"]
[{"$nulls":26},"No"]
["Minimum righting energy:",{"$nulls":4},"Design categories A and B only"]
["Item","Symbol","Unit","mMO",null,"Ref."]
["Mass in minimum operating condition","mMO","kg",{"$f":"'Worksheet 1'!I44","v":0},null,"3.5.3"]
["Area under GZ curve up to ΦV mMO","AGZ","m deg",{"$f":"'Worksheet 6a'!D177","v":{"$error":"#VALUE!"}},null,"6.4"]
["Righting energy up to ΦV = mMO AGZ","EGZ","kg m deg",{"$f":"D9*D10","v":{"$error":"#VALUE!"}},null,"6.4"]
["Requirement: For Category A: EGZ ≥ 172 000; for Category B: EGZ ≥ 57 000.",{"$nulls":4},"Table 4"]
["Category possible on minimum energy:",null,null,{"$f":"IF(D11>=172000,\"A\",IF(D11>=57000,\"B\",\"\"))","v":{"$error":"#VALUE!"}}]
[]
["Angle of vanishing stability:"]
["Item","Symbol","Unit","mMO","mLA","Ref."]
["Required value of angle of vanishing stability:\nCategory A = (130 – m/500) but ≥ 100°\nCategory B = (130 – m/200) but ≥ 95°\nCategory C = 90°\nCategory D = 75°","ΦV(R)","degree",{"$f":"IF('Worksheet 1'!$D$8=\"A\",MAX(100,130-'Worksheet 1'!I44/500),IF('Worksheet 1'!$D$8=\"B\",MAX(130-'Worksheet 1'!I44/200,95),IF('Worksheet 1'!$D$8=\"C\",90,75)))","v":{"v":75,"d":"75.00"}},{"$f":"IF('Worksheet 1'!$D$8=\"A\",MAX(100,130-'Worksheet 1'!I37/500),IF('Worksheet 1'!$D$8=\"B\",MAX(130-'Worksheet 1'!I37/200,95),IF('Worksheet 1'!$D$8=\"C\",90,75)))","v":{"v":75,"d":"75.00"}},"6.5\nTable 5"]
["Actual angle of vanishing stability:","ΦV","degree",{"$f":"'Worksheet 6a'!A177","v":{"$error":"#VALUE!"}},{"$f":"'Worksheet 6b'!A177","v":{"$error":"#VALUE!"}},"3.4.10",null,"Please insert curve data in worksheet 6a and 6b"]
["Category possible on angle of vanishing stability:",null,null,{"$f":"IF(D18>=MAX(100,130-'Worksheet 1'!$I$44/500),\"A\",IF(D18>=MAX(95,130-'Worksheet 1'!$I$44/200),\"B\",IF(D18>=90,\"C\",IF(D18>=75,\"D\",\"Fail\"))))","v":{"$error":"#VALUE!"}},{"$f":"IF(E18>=MAX(100,130-'Worksheet 1'!$I$37/500),\"A\",IF(E18>=MAX(95,130-'Worksheet 1'!$I$37/200),\"B\",IF(E18>=90,\"C\",IF(E18>=75,\"D\",\"Fail\"))))","v":{"$error":"#VALUE!"}},"6.5.1",null,"For checking you can overwrite the cells in D19 and E19, but in this case the automatical insert is stopped"]
[]
["Alternative for Design Category B only:",null,null,"method used?"]
["Item","Symbol","Unit","mMO","mLA","Ref."]
["Mass of boat in each condition","mMO or mLA","kg",{"$f":"'Worksheet 1'!I44","v":0},{"$f":"'Worksheet 1'!I37","v":0},"3.5.3 or 3.5.6 "]
["Required value of f V = (130 - 0,005m) but always ≥ 75°","ΦV(R)","degree",{"$f":"MAX(75,130-0.005*D23)","v":130},{"$f":"MAX(75,130-0.005*E23)","v":130},"6.5.2a)"]
["Actual angle of vanishing stability:","ΦV","degree",{"$f":"D18","v":{"$error":"#VALUE!"}},{"$f":"E18","v":{"$error":"#VALUE!"}},"3.4.10"]
["Is required value of fV attained?",null,"Yes / No",{"$f":"IF(D25>D24,\"Yes\",\"No\")","v":{"$error":"#VALUE!"}},{"$f":"IF(E25>E24,\"Yes\",\"No\")","v":{"$error":"#VALUE!"}},"6.5.2a)"]
["Volume of buoyancy calculated according to annex D","VB","m3 ",{"$f":"'Worksheet 10'!D38","v":0},null,"annex D",null,"Please fill in worksheet 10"]
["Mass of boat in maximum load condition","mLDC","kg",{"$f":"'Worksheet 1'!I35","v":0},null,"3.5.5"]
["Is VB > (mLDC/850) ?",null,"Yes / No",{"$f":"IF(D27>D28/850,\"Yes\",\"No\")","v":"No"},null,"6.5.2b)"]
["Are accesses to non-habitable compartments fitted with hatches or doors watertight to degree 2 and marked “Keep shut when under way” ?",null,"Yes / No",null,null,"6.5.2c)"]
["Do flotation elements (where fitted) comply with annex E ?",null,"Yes / No",null,null,"6.5.2d)"]
["Is stability information required by 6.5.2e) supplied ?",null,"Yes / No",null,null,"6.5.2e)"]
["Are safety signs according to Figure 3 displayed ? ",null,"Yes / No",null,null,"6.5.2f)"]
["Can boat be assigned Design Category B?     .",null,null,{"$f":"IF(AND(D33=\"YES\",D32=\"YES;D31=YES\",D30=\"YES\",D29=\"YES\",D26=\"YES\",E26=\"YES\"),\"YES\",\"NO\")","v":{"$error":"#VALUE!"}},null,"6.5.2",null,"only if all answers are yes"]

{"sheet":"Worksheet 6a","index":9,"n_rows":184,"n_cols":62,"rows_kept":184,"merged":[[0,14,0,15],[2,0,2,10],[4,0,4,10],[175,0,175,1],[175,3,175,4],[176,0,176,1],[176,3,176,4]]}
[{"$nulls":14},"Comments"]
[{"$nulls":15},"Derived values"]
["ISO 12217-2:2017   CALCULATION WORKSHEET No. 6a    curve of righting moment mMO",{"$nulls":14},"Input values"]
[]
[{"$f":"CONCATENATE(coverSheet!B5,\"          \",coverSheet!B12)","v":"          "}]
[{"$nulls":48},"list:"]
["insert curve of righting moment in 5° steps in one of following units:",{"$nulls":47},"MW1"]
[null,"N m","kg m","m",{"$nulls":44},"MW2"]
[]
["chosen unit"]
[]
[]
["heeling angle[°]","insert Heeling Arm/Moment [Nm, kg m, m]","Heeling Moment [Nm]","Heeling Moment \n[kg m]","Arm Gz \n[m]","Diff(B-A/5)","Basis",{"$nulls":46},"heeling angle[°]","Arm\n[m]","Check > 0",null,"Flächenberechnung",null,null,"Arm [m]"]
[0,null,{"$f":"D14*9.806","v":{"$error":"#VALUE!"}},{"$f":"E14*'Worksheet 1'!$I$44","v":{"$error":"#VALUE!"}},{"$f":"IF($B$10=\"N m\",B14/9.806/'Worksheet 1'!$I$44,IF($B$10=\"kg m\",B14/'Worksheet 1'!$I$44,IF($B$10=\"m\",B14,\"error\")))","v":"error"},{"$f":"(E19-E14)/5","v":{"$error":"#VALUE!"}},0,{"$nulls":46},0,{"$f":"E14","v":"error"},{"$f":"IF(BC14>=0,\"X\",\"\")","v":"X"},{"$f":"IF(AND(BD14=\"X\",BD15=\"\"),BB14,\"\")","v":{"$error":"#VALUE!"}},{"$f":"IF(AND(BB14<=$BC$177,BD14=\"X\"),E14,\"\")","v":{"$error":"#VALUE!"}},null,0,{"$f":"IF(E14>=0,E14,\"\")","v":"error"},{"$f":"IF(BI14>=0,\"X\",\"\")","v":"X"}]
[1,null,{"$error":"#VALUE!"},{"$f":"E15*'Worksheet 1'!$I$44","v":{"$error":"#VALUE!"}},{"$f":"E14+F14","v":{"$error":"#VALUE!"}},null,0,{"$nulls":46},1,{"$error":"#VALUE!"},{"$f":"IF(BC15>0,\"X\",\"\")","v":{"$error":"#VALUE!"}},{"$error":"#VALUE!"},{"$f":"IF(AND(BB15<=$BC$177,BD15=\"X\"),E15,\"\")","v":{"$error":"#VALUE!"}},null,1,{"$f":"IF(E15>=0,E15,\"\")","v":{"$error":"#VALUE!"}},{"$error":"#VALUE!"}]
[2,null,{"$error":"#VALUE!"},{"$f":"E16*'Worksheet 1'!$I$44","v":{"$error":"#VALUE!"}},{"$f":"E15+F14","v":{"$error":"#VALUE!"}},null,0,{"$nulls":46},2,{"$error":"#VALUE!"},{"$error":"#VALUE!"},{"$error":"#VALUE!"},{"$error":"#VALUE!"},null,2,{"$error":"#VALUE!"},{"$error":"#VALUE!"}]
[3,null,{"$error":"#VALUE!"},{"$f":"E17*'Worksheet 1'!$I$44","v":{"$error":"#VALUE!"}},{"$f":"E16+F14","v":{"$error":"#VALUE!"}},null,0,{"$nulls":46},3,{"$error":"#VALUE!"},{"$error":"#VALUE!"},{"$error":"#VALUE!"},{"$error":"#VALUE!"},null,3,{"$error":"#VALUE!"},{"$error":"#VALUE!"}]
[4,null,{"$error":"#VALUE!"},{"$f":"E18*'Worksheet 1'!$I$44","v":{"$error":"#VALUE!"}},{"$f":"E17+F14","v":{"$error":"#VALUE!"}},null,0,{"$nulls":46},4,{"$error":"#VALUE!"},{"$error":"#VALUE!"},{"$error":"#VALUE!"},{"$error":"#VALUE!"},null,4,{"$error":"#VALUE!"},{"$error":"#VALUE!"}]
[5,null,{"$error":"#VALUE!"},{"$f":"E19*'Worksheet 1'!$I$44","v":{"$error":"#VALUE!"}},{"$f":"IF($B$10=\"N m\",B19/9.806/'Worksheet 1'!$I$44,IF($B$10=\"kg m\",B19/'Worksheet 1'!$I$44,IF($B$10=\"m\",B19,\"error\")))","v":"error"},{"$f":"(E24-E19)/5","v":{"$error":"#VALUE!"}},0,{"$nulls":46},5,"error","X",{"$error":"#VALUE!"},{"$error":"#VALUE!"},null,5,"error","X"]
[6,null,{"$error":"#VALUE!"},{"$f":"E20*'Worksheet 1'!$I$44","v":{"$error":"#VALUE!"}},{"$f":"E19+F19","v":{"$error":"#VALUE!"}},null,0,{"$nulls":46},6,{"$error":"#VALUE!"},{"$error":"#VALUE!"},{"$error":"#VALUE!"},{"$error":"#VALUE!"},null,6,{"$error":"#VALUE!"},{"$error":"#VALUE!"}]
[7,null,{"$error":"#VALUE!"},{"$f":"E21*'Worksheet 1'!$I$44","v":{"$error":"#VALUE!"}},{"$f":"E20+F19","v":{"$error":"#VALUE!"}},null,0,{"$nulls":46},7,{"$error":"#VALUE!"},{"$error":"#VALUE!"},{"$error":"#VALUE!"},{"$error":"#VALUE!"},null,7,{"$error":"#VALUE!"},{"$error":"#VALUE!"}]
[8,null,{"$error":"#VALUE!"},{"$f":"E22*'Worksheet 1'!$I$44","v":{"$error":"#VALUE!"}},{"$f":"E21+F19","v":{"$error":"#VALUE!"}},null,0,{"$nulls":46},8,{"$error":"#VALUE!"},{"$error":"#VALUE!"},{"$error":"#VALUE!"},{"$error":"#VALUE!"},null,8,{"$error":"#VALUE!"},{"$error":"#VALUE!"}]
[9,null,{"$error":"#VALUE!"},{"$f":"E23*'Worksheet 1'!$I$44","v":{"$error":"#VALUE!"}},{"$f":"E22+F19","v":{"$error":"#VALUE!"}},null,0,{"$nulls":46},9,{"$error":"#VALUE!"},{"$error":"#VALUE!"},{"$error":"#VALUE!"},{"$error":"#VALUE!"},null,9,{"$error":"#VALUE!"},{"$error":"#VALUE!"}]
[10,null,{"$error":"#VALUE!"},{"$f":"E24*'Worksheet 1'!$I$44","v":{"$error":"#VALUE!"}},{"$f":"IF($B$10=\"N m\",B24/9.806/'Worksheet 1'!$I$44,IF($B$10=\"kg m\",B24/'Worksheet 1'!$I$44,IF($B$10=\"m\",B24,\"error\")))","v":"error"},{"$f":"(E29-E24)/5","v":{"$error":"#VALUE!"}},0,{"$nulls":46},10,"error","X",{"$error":"#VALUE!"},{"$error":"#VALUE!"},null,10,"error","X"]
[11,null,{"$error":"#VALUE!"},{"$f":"E25*'Worksheet 1'!$I$44","v":{"$error":"#VALUE!"}},{"$f":"E24+F24","v":{"$error":"#VALUE!"}},null,0,{"$nulls":46},11,{"$error":"#VALUE!"},{"$error":"#VALUE!"},{"$error":"#VALUE!"},{"$error":"#VALUE!"},null,11,{"$error":"#VALUE!"},{"$error":"#VALUE!"}]
[12,null,{"$error":"#VALUE!"},{"$f":"E26*'Worksheet 1'!$I$44","v":{"$error":"#VALUE!"}},{"$f":"E25+F24","v":{"$error":"#VALUE!"}},null,0,{"$nulls":46},12,{"$error":"#VALUE!"},{"$error":"#VALUE!"},{"$error":"#VALUE!"},{"$error":"#VALUE!"},null,12,{"$error":"#VALUE!"},{"$error":"#VALUE!"}]
[13,null,{"$error":"#VALUE!"},{"$f":"E27*'Worksheet 1'!$I$44","v":{"$error":"#VALUE!"}},{"$f":"E26+F24","v":{"$error":"#VALUE!"}},null,0,{"$nulls":46},13,{"$error":"#VALUE!"},{"$error":"#VALUE!"},{"$error":"#VALUE!"},{"$error":"#VALUE!"},null,13,{"$error":"#VALUE!"},{"$error":"#VALUE!"}]
[14,null,{"$error":"#VALUE!"},{"$f":"E28*'Worksheet 1'!$I$44","v":{"$error":"#VALUE!"}},{"$f":"E27+F24","v":{"$error":"#VALUE!"}},null,0,{"$nulls":46},14,{"$error":"#VALUE!"},{"$error":"#VALUE!"},{"$error":"#VALUE!"},{"$error":"#VALUE!"},null,14,{"$error":"#VALUE!"},{"$error":"#VALUE!"}]
[15,null,{"$error":"#VALUE!"},{"$f":"E29*'Worksheet 1'!$I$44","v":{"$error":"#VALUE!"}},{"$f":"IF($B$10=\"N m\",B29/9.806/'Worksheet 1'!$I$44,IF($B$10=\"kg m\",B29/'Worksheet 1'!$I$44,IF($B$10=\"m\",B29,\"error\")))","v":"error"},{"$f":"(E34-E29)/5","v":{"$error":"#VALUE!"}},0,{"$nulls":46},15,"error","X",{"$error":"#VALUE!"},{"$error":"#VALUE!"},null,15,"error","X"]
[16,null,{"$error":"#VALUE!"},{"$f":"E30*'Worksheet 1'!$I$44","v":{"$error":"#VALUE!"}},{"$f":"E29+F29","v":{"$error":"#VALUE!"}},null,0,{"$nulls":46},16,{"$error":"#VALUE!"},{"$error":"#VALUE!"},{"$error":"#VALUE!"},{"$error":"#VALUE!"},null,16,{"$error":"#VALUE!"},{"$error":"#VALUE!"}]
[17,null,{"$error":"#VALUE!"},{"$f":"E31*'Worksheet 1'!$I$44","v":{"$error":"#VALUE!"}},{"$f":"E30+F29","v":{"$error":"#VALUE!"}},null,0,{"$nulls":46},17,{"$error":"#VALUE!"},{"$error":"#VALUE!"},{"$error":"#VALUE!"},{"$error":"#VALUE!"},null,17,{"$error":"#VALUE!"},{"$error":"#VALUE!"}]
[18,null,{"$error":"#VALUE!"},{"$f":"E32*'Worksheet 1'!$I$44","v":{"$error":"#VALUE!"}},{"$f":"E31+F29","v":{"$error":"#VALUE!"}},null,0,{"$nulls":46},18,{"$error":"#VALUE!"},{"$error":"#VALUE!"},{"$error":"#VALUE!"},{"$error":"#VALUE!"},null,18,{"$error":"#VALUE!"},{"$error":"#VALUE!"}]
[19,null,{"$error":"#VALUE!"},{"$f":"E33*'Worksheet 1'!$I$44","v":{"$error":"#VALUE!"}},{"$f":"E32+F29","v":{"$error":"#VALUE!"}},null,0,{"$nulls":46},19,{"$error":"#VALUE!"},{"$error":"#VALUE!"},{"$error":"#VALUE!"},{"$error":"#VALUE!"},null,19,{"$error":"#VALUE!"},{"$error":"#VALUE!"}]
[20,null,{"$error":"#VALUE!"},{"$f":"E34*'Worksheet 1'!$I$44","v":{"$error":"#VALUE!"}},{"$f":"IF($B$10=\"N m\",B34/9.806/'Worksheet 1'!$I$44,IF($B$10=\"kg m\",B34/'Worksheet 1'!$I$44,IF($B$10=\"m\",B34,\"error\")))","v":"error"},{"$f":"(E39-E34)/5","v":{"$error":"#VALUE!"}},0,{"$nulls":46},20,"error","X",{"$error":"#VALUE!"},{"$error":"#VALUE!"},null,20,"error","X"]
[21,null,{"$error":"#VALUE!"},{"$f":"E35*'Worksheet 1'!$I$44","v":{"$error":"#VALUE!"}},{"$f":"E34+F34","v":{"$error":"#VALUE!"}},null,0,{"$nulls":46},21,{"$error":"#VALUE!"},{"$error":"#VALUE!"},{"$error":"#VALUE!"},{"$error":"#VALUE!"},null,21,{"$error":"#VALUE!"},{"$error":"#VALUE!"}]
[22,null,{"$error":"#VALUE!"},{"$f":"E36*'Worksheet 1'!$I$44","v":{"$error":"#VALUE!"}},{"$f":"E35+F34","v":{"$error":"#VALUE!"}},null,0,{"$nulls":46},22,{"$error":"#VALUE!"},{"$error":"#VALUE!"},{"$error":"#VALUE!"},{"$error":"#VALUE!"},null,22,{"$error":"#VALUE!"},{"$error":"#VALUE!"}]
[23,null,{"$error":"#VALUE!"},{"$f":"E37*'Worksheet 1'!$I$44","v":{"$error":"#VALUE!"}},{"$f":"E36+F34","v":{"$error":"#VALUE!"}},null,0,{"$nulls":46},23,{"$error":"#VALUE!"},{"$error":"#VALUE!"},{"$error":"#VALUE!"},{"$error":"#VALUE!"},null,23,{"$error":"#VALUE!"},{"$error":"#VALUE!"}]
[24,null,{"$error":"#VALUE!"},{"$f":"E38*'Worksheet 1'!$I$44","v":{"$error":"#VALUE!"}},{"$f":"E37+F34","v":{"$error":"#VALUE!"}},null,0,{"$nulls":46},24,{"$error":"#VALUE!"},{"$error":"#VALUE!"},{"$error":"#VALUE!"},{"$error":"#VALUE!"},null,24,{"$error":"#VALUE!"},{"$error":"#VALUE!"}]
[25,null,{"$error":"#VALUE!"},{"$f":"E39*'Worksheet 1'!$I$44","v":{"$error":"#VALUE!"}},{"$f":"IF($B$10=\"N m\",B39/9.806/'Worksheet 1'!$I$44,IF($B$10=\"kg m\",B39/'Worksheet 1'!$I$44,IF($B$10=\"m\",B39,\"error\")))","v":"error"},{"$f":"(E44-E39)/5","v":{"$error":"#VALUE!"}},0,{"$nulls":46},25,"error","X",{"$error":"#VALUE!"},{"$error":"#VALUE!"},null,25,"error","X"]
[26,null,{"$error":"#VALUE!"},{"$f":"E40*'Worksheet 1'!$I$44","v":{"$error":"#VALUE!"}},{"$f":"E39+F39","v":{"$error":"#VALUE!"}},null,0,{"$nulls":46},26,{"$error":"#VALUE!"},{"$error":"#VALUE!"},{"$error":"#VALUE!"},{"$error":"#VALUE!"},null,26,{"$error":"#VALUE!"},{"$error":"#VALUE!"}]
[27,null,{"$error":"#VALUE!"},{"$f":"E41*'Worksheet 1'!$I$44","v":{"$error":"#VALUE!"}},{"$f":"E40+F39","v":{"$error":"#VALUE!"}},null,0,{"$nulls":46},27,{"$error":"#VALUE!"},{"$error":"#VALUE!"},{"$error":"#VALUE!"},{"$error":"#VALUE!"},null,27,{"$error":"#VALUE!"},{"$error":"#VALUE!"}]
[28,null,{"$error":"#VALUE!"},{"$f":"E42*'Worksheet 1'!$I$44","v":{"$error":"#VALUE!"}},{"$f":"E41+F39","v":{"$error":"#VALUE!"}},null,0,{"$nulls":46},28,{"$error":"#VALUE!"},{"$error":"#VALUE!"},{"$error":"#VALUE!"},{"$error":"#VALUE!"},null,28,{"$error":"#VALUE!"},{"$error":"#VALUE!"}]
[29,null,{"$error":"#VALUE!"},{"$f":"E43*'Worksheet 1'!$I$44","v":{"$error":"#VALUE!"}},{"$f":"E42+F39","v":{"$error":"#VALUE!"}},null,0,{"$nulls":46},29,{"$error":"#VALUE!"},{"$error":"#VALUE!"},{"$error":"#VALUE!"},{"$error":"#VALUE!"},null,29,{"$error":"#VALUE!"},{"$error":"#VALUE!"}]
[30,null,{"$error":"#VALUE!"},{"$f":"E44*'Worksheet 1'!$I$44","v":{"$error":"#VALUE!"}},{"$f":"IF($B$10=\"N m\",B44/9.806/'Worksheet 1'!$I$44,IF($B$10=\"kg m\",B44/'Worksheet 1'!$I$44,IF($B$10=\"m\",B44,\"error\")))","v":"error"},{"$f":"(E49-E44)/5","v":{"$error":"#VALUE!"}},0,{"$nulls":46},30,"error","X",{"$error":"#VALUE!"},{"$error":"#VALUE!"},null,30,"error","X"]
[31,null,{"$error":"#VALUE!"},{"$f":"E45*'Worksheet 1'!$I$44","v":{"$error":"#VALUE!"}},{"$f":"E44+F44","v":{"$error":"#VALUE!"}},null,0,{"$nulls":46},31,{"$error":"#VALUE!"},{"$error":"#VALUE!"},{"$error":"#VALUE!"},{"$error":"#VALUE!"},null,31,{"$error":"#VALUE!"},{"$error":"#VALUE!"}]
[32,null,{"$error":"#VALUE!"},{"$f":"E46*'Worksheet 1'!$I$44","v":{"$error":"#VALUE!"}},{"$f":"E45+F44","v":{"$error":"#VALUE!"}},null,0,{"$nulls":46},32,{"$error":"#VALUE!"},{"$error":"#VALUE!"},{"$error":"#VALUE!"},{"$error":"#VALUE!"},null,32,{"$error":"#VALUE!"},{"$error":"#VALUE!"}]
[33,null,{"$error":"#VALUE!"},{"$f":"E47*'Worksheet 1'!$I$44","v":{"$error":"#VALUE!"}},{"$f":"E46+F44","v":{"$error":"#VALUE!"}},null,0,{"$nulls":46},33,{"$error":"#VALUE!"},{"$error":"#VALUE!"},{"$error":"#VALUE!"},{"$error":"#VALUE!"},null,33,{"$error":"#VALUE!"},{"$error":"#VALUE!"}]
[34,null,{"$error":"#VALUE!"},{"$f":"E48*'Worksheet 1'!$I$44","v":{"$error":"#VALUE!"}},{"$f":"E47+F44","v":{"$error":"#VALUE!"}},null,0,{"$nulls":46},34,{"$error":"#VALUE!"},{"$error":"#VALUE!"},{"$error":"#VALUE!"},{"$error":"#VALUE!"},null,34,{"$error":"#VALUE!"},{"$error":"#VALUE!"}]
[35,null,{"$error":"#VALUE!"},{"$f":"E49*'Worksheet 1'!$I$44","v":{"$error":"#VALUE!"}},{"$f":"IF($B$10=\"N m\",B49/9.806/'Worksheet 1'!$I$44,IF($B$10=\"kg m\",B49/'Worksheet 1'!$I$44,IF($B$10=\"m\",B49,\"error\")))","v":"error"},{"$f":"(E54-E49)/5","v":{"$error":"#VALUE!"}},0,{"$nulls":46},35,"error","X",{"$error":"#VALUE!"},{"$error":"#VALUE!"},null,35,"error","X"]
[36,null,{"$error":"#VALUE!"},{"$f":"E50*'Worksheet 1'!$I$44","v":{"$error":"#VALUE!"}},{"$f":"E49+F49","v":{"$error":"#VALUE!"}},null,0,{"$nulls":46},36,{"$error":"#VALUE!"},{"$error":"#VALUE!"},{"$error":"#VALUE!"},{"$error":"#VALUE!"},null,36,{"$error":"#VALUE!"},{"$error":"#VALUE!"}]
[37,null,{"$error":"#VALUE!"},{"$f":"E51*'Worksheet 1'!$I$44","v":{"$error":"#VALUE!"}},{"$f":"E50+F49","v":{"$error":"#VALUE!"}},null,0,{"$nulls":46},37,{"$error":"#VALUE!"},{"$error":"#VALUE!"},{"$error":"#VALUE!"},{"$error":"#VALUE!"},null,37,{"$error":"#VALUE!"},{"$error":"#VALUE!"}]
[38,null,{"$error":"#VALUE!"},{"$f":"E52*'Worksheet 1'!$I$44","v":{"$error":"#VALUE!"}},{"$f":"E51+F49","v":{"$error":"#VALUE!"}},null,0,{"$nulls":46},38,{"$error":"#VALUE!"},{"$error":"#VALUE!"},{"$error":"#VALUE!"},{"$error":"#VALUE!"},null,38,{"$error":"#VALUE!"},{"$error":"#VALUE!"}]
[39,null,{"$error":"#VALUE!"},{"$f":"E53*'Worksheet 1'!$I$44","v":{"$error":"#VALUE!"}},{"$f":"E52+F49","v":{"$error":"#VALUE!"}},null,0,{"$nulls":46},39,{"$error":"#VALUE!"},{"$error":"#VALUE!"},{"$error":"#VALUE!"},{"$error":"#VALUE!"},null,39,{"$error":"#VALUE!"},{"$error":"#VALUE!"}]
[40,null,{"$error":"#VALUE!"},{"$f":"E54*'Worksheet 1'!$I$44","v":{"$error":"#VALUE!"}},{"$f":"IF($B$10=\"N m\",B54/9.806/'Worksheet 1'!$I$44,IF($B$10=\"kg m\",B54/'Worksheet 1'!$I$44,IF($B$10=\"m\",B54,\"error\")))","v":"error"},{"$f":"(E59-E54)/5","v":{"$error":"#VALUE!"}},0,{"$nulls":46},40,"error","X",{"$error":"#VALUE!"},{"$error":"#VALUE!"},null,40,"error","X"]
[41,null,{"$error":"#VALUE!"},{"$f":"E55*'Worksheet 1'!$I$44","v":{"$error":"#VALUE!"}},{"$f":"E54+F54","v":{"$error":"#VALUE!"}},null,0,{"$nulls":46},41,{"$error":"#VALUE!"},{"$error":"#VALUE!"},{"$error":"#VALUE!"},{"$error":"#VALUE!"},null,41,{"$error":"#VALUE!"},{"$error":"#VALUE!"}]
[42,null,{"$error":"#VALUE!"},{"$f":"E56*'Worksheet 1'!$I$44","v":{"$error":"#VALUE!"}},{"$f":"E55+F54","v":{"$error":"#VALUE!"}},null,0,{"$nulls":46},42,{"$error":"#VALUE!"},{"$error":"#VALUE!"},{"$error":"#VALUE!"},{"$error":"#VALUE!"},null,42,{"$error":"#VALUE!"},{"$error":"#VALUE!"}]
[43,null,{"$error":"#VALUE!"},{"$f":"E57*'Worksheet 1'!$I$44","v":{"$error":"#VALUE!"}},{"$f":"E56+F54","v":{"$error":"#VALUE!"}},null,0,{"$nulls":46},43,{"$error":"#VALUE!"},{"$error":"#VALUE!"},{"$error":"#VALUE!"},{"$error":"#VALUE!"},null,43,{"$error":"#VALUE!"},{"$error":"#VALUE!"}]
[44,null,{"$error":"#VALUE!"},{"$f":"E58*'Worksheet 1'!$I$44","v":{"$error":"#VALUE!"}},{"$f":"E57+F54","v":{"$error":"#VALUE!"}},null,0,{"$nulls":46},44,{"$error":"#VALUE!"},{"$error":"#VALUE!"},{"$error":"#VALUE!"},{"$error":"#VALUE!"},null,44,{"$error":"#VALUE!"},{"$error":"#VALUE!"}]
[45,null,{"$error":"#VALUE!"},{"$f":"E59*'Worksheet 1'!$I$44","v":{"$error":"#VALUE!"}},{"$f":"IF($B$10=\"N m\",B59/9.806/'Worksheet 1'!$I$44,IF($B$10=\"kg m\",B59/'Worksheet 1'!$I$44,IF($B$10=\"m\",B59,\"error\")))","v":"error"},{"$f":"(E64-E59)/5","v":{"$error":"#VALUE!"}},0,{"$nulls":46},45,"error","X",{"$error":"#VALUE!"},{"$error":"#VALUE!"},null,45,"error","X"]
[46,null,{"$error":"#VALUE!"},{"$f":"E60*'Worksheet 1'!$I$44","v":{"$error":"#VALUE!"}},{"$f":"E59+F59","v":{"$error":"#VALUE!"}},null,0,{"$nulls":46},46,{"$error":"#VALUE!"},{"$error":"#VALUE!"},{"$error":"#VALUE!"},{"$error":"#VALUE!"},null,46,{"$error":"#VALUE!"},{"$error":"#VALUE!"}]
[47,null,{"$error":"#VALUE!"},{"$f":"E61*'Worksheet 1'!$I$44","v":{"$error":"#VALUE!"}},{"$f":"E60+F59","v":{"$error":"#VALUE!"}},null,0,{"$nulls":46},47,{"$error":"#VALUE!"},{"$error":"#VALUE!"},{"$error":"#VALUE!"},{"$error":"#VALUE!"},null,47,{"$error":"#VALUE!"},{"$error":"#VALUE!"}]
[48,null,{"$error":"#VALUE!"},{"$f":"E62*'Worksheet 1'!$I$44","v":{"$error":"#VALUE!"}},{"$f":"E61+F59","v":{"$error":"#VALUE!"}},null,0,{"$nulls":46},48,{"$error":"#VALUE!"},{"$error":"#VALUE!"},{"$error":"#VALUE!"},{"$error":"#VALUE!"},null,48,{"$error":"#VALUE!"},{"$error":"#VALUE!"}]
[49,null,{"$error":"#VALUE!"},{"$f":"E63*'Worksheet 1'!$I$44","v":{"$error":"#VALUE!"}},{"$f":"E62+F59","v":{"$error":"#VALUE!"}},null,0,{"$nulls":46},49,{"$error":"#VALUE!"},{"$error":"#VALUE!"},{"$error":"#VALUE!"},{"$error":"#VALUE!"},null,49,{"$error":"#VALUE!"},{"$error":"#VALUE!"}]
[50,null,{"$error":"#VALUE!"},{"$f":"E64*'Worksheet 1'!$I$44","v":{"$error":"#VALUE!"}},{"$f":"IF($B$10=\"N m\",B64/9.806/'Worksheet 1'!$I$44,IF($B$10=\"kg m\",B64/'Worksheet 1'!$I$44,IF($B$10=\"m\",B64,\"error\")))","v":"error"},{"$f":"(E69-E64)/5","v":{"$error":"#VALUE!"}},0,{"$nulls":46},50,"error","X",{"$error":"#VALUE!"},{"$error":"#VALUE!"},null,50,"error","X"]
[51,null,{"$error":"#VALUE!"},{"$f":"E65*'Worksheet 1'!$I$44","v":{"$error":"#VALUE!"}},{"$f":"E64+F64","v":{"$error":"#VALUE!"}},null,0,{"$nulls":46},51,{"$error":"#VALUE!"},{"$error":"#VALUE!"},{"$error":"#VALUE!"},{"$error":"#VALUE!"},null,51,{"$error":"#VALUE!"},{"$error":"#VALUE!"}]
[52,null,{"$error":"#VALUE!"},{"$f":"E66*'Worksheet 1'!$I$44","v":{"$error":"#VALUE!"}},{"$f":"E65+F64","v":{"$error":"#VALUE!"}},null,0,{"$nulls":46},52,{"$error":"#VALUE!"},{"$error":"#VALUE!"},{"$error":"#VALUE!"},{"$error":"#VALUE!"},null,52,{"$error":"#VALUE!"},{"$error":"#VALUE!"}]
[53,null,{"$error":"#VALUE!"},{"$f":"E67*'Worksheet 1'!$I$44","v":{"$error":"#VALUE!"}},{"$f":"E66+F64","v":{"$error":"#VALUE!"}},null,0,{"$nulls":46},53,{"$error":"#VALUE!"},{"$error":"#VALUE!"},{"$error":"#VALUE!"},{"$error":"#VALUE!"},null,53,{"$error":"#VALUE!"},{"$error":"#VALUE!"}]
[54,null,{"$error":"#VALUE!"},{"$f":"E68*'Worksheet 1'!$I$44","v":{"$error":"#VALUE!"}},{"$f":"E67+F64","v":{"$error":"#VALUE!"}},null,0,{"$nulls":46},54,{"$error":"#VALUE!"},{"$error":"#VALUE!"},{"$error":"#VALUE!"},{"$error":"#VALUE!"},null,54,{"$error":"#VALUE!"},{"$error":"#VALUE!"}]
[55,null,{"$error":"#VALUE!"},{"$f":"E69*'Worksheet 1'!$I$44","v":{"$error":"#VALUE!"}},{"$f":"IF($B$10=\"N m\",B69/9.806/'Worksheet 1'!$I$44,IF($B$10=\"kg m\",B69/'Worksheet 1'!$I$44,IF($B$10=\"m\",B69,\"error\")))","v":"error"},{"$f":"(E74-E69)/5","v":{"$error":"#VALUE!"}},0,{"$nulls":46},55,"error","X",{"$error":"#VALUE!"},{"$error":"#VALUE!"},null,55,"error","X"]
[56,null,{"$error":"#VALUE!"},{"$f":"E70*'Worksheet 1'!$I$44","v":{"$error":"#VALUE!"}},{"$f":"E69+F69","v":{"$error":"#VALUE!"}},null,0,{"$nulls":46},56,{"$error":"#VALUE!"},{"$error":"#VALUE!"},{"$error":"#VALUE!"},{"$error":"#VALUE!"},null,56,{"$error":"#VALUE!"},{"$error":"#VALUE!"}]
[57,null,{"$error":"#VALUE!"},{"$f":"E71*'Worksheet 1'!$I$44","v":{"$error":"#VALUE!"}},{"$f":"E70+F69","v":{"$error":"#VALUE!"}},null,0,{"$nulls":46},57,{"$error":"#VALUE!"},{"$error":"#VALUE!"},{"$error":"#VALUE!"},{"$error":"#VALUE!"},null,57,{"$error":"#VALUE!"},{"$error":"#VALUE!"}]
[58,null,{"$error":"#VALUE!"},{"$f":"E72*'Worksheet 1'!$I$44","v":{"$error":"#VALUE!"}},{"$f":"E71+F69","v":{"$error":"#VALUE!"}},null,0,{"$nulls":46},58,{"$error":"#VALUE!"},{"$error":"#VALUE!"},{"$error":"#VALUE!"},{"$error":"#VALUE!"},null,58,{"$error":"#VALUE!"},{"$error":"#VALUE!"}]
[59,null,{"$error":"#VALUE!"},{"$f":"E73*'Worksheet 1'!$I$44","v":{"$error":"#VALUE!"}},{"$f":"E72+F69","v":{"$error":"#VALUE!"}},null,0,{"$nulls":46},59,{"$error":"#VALUE!"},{"$error":"#VALUE!"},{"$error":"#VALUE!"},{"$error":"#VALUE!"},null,59,{"$error":"#VALUE!"},{"$error":"#VALUE!"}]
[60,null,{"$error":"#VALUE!"},{"$f":"E74*'Worksheet 1'!$I$44","v":{"$error":"#VALUE!"}},{"$f":"IF($B$10=\"N m\",B74/9.806/'Worksheet 1'!$I$44,IF($B$10=\"kg m\",B74/'Worksheet 1'!$I$44,IF($B$10=\"m\",B74,\"error\")))","v":"error"},{"$f":"(E79-E74)/5","v":{"$error":"#VALUE!"}},0,{"$nulls":46},60,"error","X",{"$error":"#VALUE!"},{"$error":"#VALUE!"},null,60,"error","X"]
[61,null,{"$error":"#VALUE!"},{"$f":"E75*'Worksheet 1'!$I$44","v":{"$error":"#VALUE!"}},{"$f":"E74+F74","v":{"$error":"#VALUE!"}},null,0,{"$nulls":46},61,{"$error":"#VALUE!"},{"$error":"#VALUE!"},{"$error":"#VALUE!"},{"$error":"#VALUE!"},null,61,{"$error":"#VALUE!"},{"$error":"#VALUE!"}]
[62,null,{"$error":"#VALUE!"},{"$f":"E76*'Worksheet 1'!$I$44","v":{"$error":"#VALUE!"}},{"$f":"E75+F74","v":{"$error":"#VALUE!"}},null,0,{"$nulls":46},62,{"$error":"#VALUE!"},{"$error":"#VALUE!"},{"$error":"#VALUE!"},{"$error":"#VALUE!"},null,62,{"$error":"#VALUE!"},{"$error":"#VALUE!"}]
[63,null,{"$error":"#VALUE!"},{"$f":"E77*'Worksheet 1'!$I$44","v":{"$error":"#VALUE!"}},{"$f":"E76+F74","v":{"$error":"#VALUE!"}},null,0,{"$nulls":46},63,{"$error":"#VALUE!"},{"$error":"#VALUE!"},{"$error":"#VALUE!"},{"$error":"#VALUE!"},null,63,{"$error":"#VALUE!"},{"$error":"#VALUE!"}]
[64,null,{"$f":"D78*9.806","v":{"$error":"#VALUE!"}},{"$f":"E78*'Worksheet 1'!$I$44","v":{"$error":"#VALUE!"}},{"$f":"E77+F74","v":{"$error":"#VALUE!"}},null,0,{"$nulls":46},64,{"$f":"E78","v":{"$error":"#VALUE!"}},{"$error":"#VALUE!"},{"$f":"IF(AND(BD78=\"X\",BD79=\"\"),BB78,\"\")","v":{"$error":"#VALUE!"}},{"$error":"#VALUE!"},null,64,{"$error":"#VALUE!"},{"$f":"IF(BI78>=0,\"X\",\"\")","v":{"$error":"#VALUE!"}}]
[65,null,{"$error":"#VALUE!"},{"$f":"E79*'Worksheet 1'!$I$44","v":{"$error":"#VALUE!"}},{"$f":"IF($B$10=\"N m\",B79/9.806/'Worksheet 1'!$I$44,IF($B$10=\"kg m\",B79/'Worksheet 1'!$I$44,IF($B$10=\"m\",B79,\"error\")))","v":"error"},{"$f":"(E84-E79)/5","v":{"$error":"#VALUE!"}},0,{"$nulls":46},65,"error",{"$f":"IF(BC79>0,\"X\",\"\")","v":"X"},{"$error":"#VALUE!"},{"$f":"IF(AND(BB79<=$BC$177,BD79=\"X\"),E79,\"\")","v":{"$error":"#VALUE!"}},null,65,{"$f":"IF(E79>=0,E79,\"\")","v":"error"},"X"]
[66,null,{"$error":"#VALUE!"},{"$f":"E80*'Worksheet 1'!$I$44","v":{"$error":"#VALUE!"}},{"$f":"E79+F79","v":{"$error":"#VALUE!"}},null,0,{"$nulls":46},66,{"$error":"#VALUE!"},{"$error":"#VALUE!"},{"$error":"#VALUE!"},{"$error":"#VALUE!"},null,66,{"$error":"#VALUE!"},{"$error":"#VALUE!"}]
[67,null,{"$error":"#VALUE!"},{"$f":"E81*'Worksheet 1'!$I$44","v":{"$error":"#VALUE!"}},{"$f":"E80+F79","v":{"$error":"#VALUE!"}},null,0,{"$nulls":46},67,{"$error":"#VALUE!"},{"$error":"#VALUE!"},{"$error":"#VALUE!"},{"$error":"#VALUE!"},null,67,{"$error":"#VALUE!"},{"$error":"#VALUE!"}]
[68,null,{"$error":"#VALUE!"},{"$f":"E82*'Worksheet 1'!$I$44","v":{"$error":"#VALUE!"}},{"$f":"E81+F79","v":{"$error":"#VALUE!"}},null,0,{"$nulls":46},68,{"$error":"#VALUE!"},{"$error":"#VALUE!"},{"$error":"#VALUE!"},{"$error":"#VALUE!"},null,68,{"$error":"#VALUE!"},{"$error":"#VALUE!"}]
[69,null,{"$error":"#VALUE!"},{"$f":"E83*'Worksheet 1'!$I$44","v":{"$error":"#VALUE!"}},{"$f":"E82+F79","v":{"$error":"#VALUE!"}},null,0,{"$nulls":46},69,{"$error":"#VALUE!"},{"$error":"#VALUE!"},{"$error":"#VALUE!"},{"$error":"#VALUE!"},null,69,{"$error":"#VALUE!"},{"$error":"#VALUE!"}]
[70,null,{"$error":"#VALUE!"},{"$f":"E84*'Worksheet 1'!$I$44","v":{"$error":"#VALUE!"}},{"$f":"IF($B$10=\"N m\",B84/9.806/'Worksheet 1'!$I$44,IF($B$10=\"kg m\",B84/'Worksheet 1'!$I$44,IF($B$10=\"m\",B84,\"error\")))","v":"error"},{"$f":"(E89-E84)/5","v":{"$error":"#VALUE!"}},0,{"$nulls":46},70,"error","X",{"$error":"#VALUE!"},{"$error":"#VALUE!"},null,70,"error","X"]
[71,null,{"$error":"#VALUE!"},{"$f":"E85*'Worksheet 1'!$I$44","v":{"$error":"#VALUE!"}},{"$f":"E84+F84","v":{"$error":"#VALUE!"}},null,0,{"$nulls":46},71,{"$error":"#VALUE!"},{"$error":"#VALUE!"},{"$error":"#VALUE!"},{"$error":"#VALUE!"},null,71,{"$error":"#VALUE!"},{"$error":"#VALUE!"}]
[72,null,{"$error":"#VALUE!"},{"$f":"E86*'Worksheet 1'!$I$44","v":{"$error":"#VALUE!"}},{"$f":"E85+F84","v":{"$error":"#VALUE!"}},null,0,{"$nulls":46},72,{"$error":"#VALUE!"},{"$error":"#VALUE!"},{"$error":"#VALUE!"},{"$error":"#VALUE!"},null,72,{"$error":"#VALUE!"},{"$error":"#VALUE!"}]
[73,null,{"$error":"#VALUE!"},{"$f":"E87*'Worksheet 1'!$I$44","v":{"$error":"#VALUE!"}},{"$f":"E86+F84","v":{"$error":"#VALUE!"}},null,0,{"$nulls":46},73,{"$error":"#VALUE!"},{"$error":"#VALUE!"},{"$error":"#VALUE!"},{"$error":"#VALUE!"},null,73,{"$error":"#VALUE!"},{"$error":"#VALUE!"}]
[74,null,{"$error":"#VALUE!"},{"$f":"E88*'Worksheet 1'!$I$44","v":{"$error":"#VALUE!"}},{"$f":"E87+F84","v":{"$error":"#VALUE!"}},null,0,{"$nulls":46},74,{"$error":"#VALUE!"},{"$error":"#VALUE!"},{"$error":"#VALUE!"},{"$error":"#VALUE!"},null,74,{"$error":"#VALUE!"},{"$error":"#VALUE!"}]
[75,null,{"$error":"#VALUE!"},{"$f":"E89*'Worksheet 1'!$I$44","v":{"$error":"#VALUE!"}},{"$f":"IF($B$10=\"N m\",B89/9.806/'Worksheet 1'!$I$44,IF($B$10=\"kg m\",B89/'Worksheet 1'!$I$44,IF($B$10=\"m\",B89,\"error\")))","v":"error"},{"$f":"(E94-E89)/5","v":{"$error":"#VALUE!"}},0,{"$nulls":46},75,"error","X",{"$error":"#VALUE!"},{"$error":"#VALUE!"},null,75,"error","X"]
[76,null,{"$error":"#VALUE!"},{"$f":"E90*'Worksheet 1'!$I$44","v":{"$error":"#VALUE!"}},{"$f":"E89+F89","v":{"$error":"#VALUE!"}},null,0,{"$nulls":46},76,{"$error":"#VALUE!"},{"$error":"#VALUE!"},{"$error":"#VALUE!"},{"$error":"#VALUE!"},null,76,{"$error":"#VALUE!"},{"$error":"#VALUE!"}]
[77,null,{"$error":"#VALUE!"},{"$f":"E91*'Worksheet 1'!$I$44","v":{"$error":"#VALUE!"}},{"$f":"E90+F89","v":{"$error":"#VALUE!"}},null,0,{"$nulls":46},77,{"$error":"#VALUE!"},{"$error":"#VALUE!"},{"$error":"#VALUE!"},{"$error":"#VALUE!"},null,77,{"$error":"#VALUE!"},{"$error":"#VALUE!"}]
[78,null,{"$error":"#VALUE!"},{"$f":"E92*'Worksheet 1'!$I$44","v":{"$error":"#VALUE!"}},{"$f":"E91+F89","v":{"$error":"#VALUE!"}},null,0,{"$nulls":46},78,{"$error":"#VALUE!"},{"$error":"#VALUE!"},{"$error":"#VALUE!"},{"$error":"#VALUE!"},null,78,{"$error":"#VALUE!"},{"$error":"#VALUE!"}]
[79,null,{"$error":"#VALUE!"},{"$f":"E93*'Worksheet 1'!$I$44","v":{"$error":"#VALUE!"}},{"$f":"E92+F89","v":{"$error":"#VALUE!"}},null,0,{"$nulls":46},79,{"$error":"#VALUE!"},{"$error":"#VALUE!"},{"$error":"#VALUE!"},{"$error":"#VALUE!"},null,79,{"$error":"#VALUE!"},{"$error":"#VALUE!"}]
[80,null,{"$error":"#VALUE!"},{"$f":"E94*'Worksheet 1'!$I$44","v":{"$error":"#VALUE!"}},{"$f":"IF($B$10=\"N m\",B94/9.806/'Worksheet 1'!$I$44,IF($B$10=\"kg m\",B94/'Worksheet 1'!$I$44,IF($B$10=\"m\",B94,\"error\")))","v":"error"},{"$f":"(E99-E94)/5","v":{"$error":"#VALUE!"}},0,{"$nulls":46},80,"error","X",{"$error":"#VALUE!"},{"$error":"#VALUE!"},null,80,"error","X"]
[81,null,{"$error":"#VALUE!"},{"$f":"E95*'Worksheet 1'!$I$44","v":{"$error":"#VALUE!"}},{"$f":"E94+F94","v":{"$error":"#VALUE!"}},null,0,{"$nulls":46},81,{"$error":"#VALUE!"},{"$error":"#VALUE!"},{"$error":"#VALUE!"},{"$error":"#VALUE!"},null,81,{"$error":"#VALUE!"},{"$error":"#VALUE!"}]
[82,null,{"$error":"#VALUE!"},{"$f":"E96*'Worksheet 1'!$I$44","v":{"$error":"#VALUE!"}},{"$f":"E95+F94","v":{"$error":"#VALUE!"}},null,0,{"$nulls":46},82,{"$error":"#VALUE!"},{"$error":"#VALUE!"},{"$error":"#VALUE!"},{"$error":"#VALUE!"},null,82,{"$error":"#VALUE!"},{"$error":"#VALUE!"}]
[83,null,{"$error":"#VALUE!"},{"$f":"E97*'Worksheet 1'!$I$44","v":{"$error":"#VALUE!"}},{"$f":"E96+F94","v":{"$error":"#VALUE!"}},null,0,{"$nulls":46},83,{"$error":"#VALUE!"},{"$error":"#VALUE!"},{"$error":"#VALUE!"},{"$error":"#VALUE!"},null,83,{"$error":"#VALUE!"},{"$error":"#VALUE!"}]
[84,null,{"$error":"#VALUE!"},{"$f":"E98*'Worksheet 1'!$I$44","v":{"$error":"#VALUE!"}},{"$f":"E97+F94","v":{"$error":"#VALUE!"}},null,0,{"$nulls":46},84,{"$error":"#VALUE!"},{"$error":"#VALUE!"},{"$error":"#VALUE!"},{"$error":"#VALUE!"},null,84,{"$error":"#VALUE!"},{"$error":"#VALUE!"}]
[85,null,{"$error":"#VALUE!"},{"$f":"E99*'Worksheet 1'!$I$44","v":{"$error":"#VALUE!"}},{"$f":"IF($B$10=\"N m\",B99/9.806/'Worksheet 1'!$I$44,IF($B$10=\"kg m\",B99/'Worksheet 1'!$I$44,IF($B$10=\"m\",B99,\"error\")))","v":"error"},{"$f":"(E104-E99)/5","v":{"$error":"#VALUE!"}},0,{"$nulls":46},85,"error","X",{"$error":"#VALUE!"},{"$error":"#VALUE!"},null,85,"error","X"]
[86,null,{"$error":"#VALUE!"},{"$f":"E100*'Worksheet 1'!$I$44","v":{"$error":"#VALUE!"}},{"$f":"E99+F99","v":{"$error":"#VALUE!"}},null,0,{"$nulls":46},86,{"$error":"#VALUE!"},{"$error":"#VALUE!"},{"$error":"#VALUE!"},{"$error":"#VALUE!"},null,86,{"$error":"#VALUE!"},{"$error":"#VALUE!"}]
[87,null,{"$error":"#VALUE!"},{"$f":"E101*'Worksheet 1'!$I$44","v":{"$error":"#VALUE!"}},{"$f":"E100+F99","v":{"$error":"#VALUE!"}},null,0,{"$nulls":46},87,{"$error":"#VALUE!"},{"$error":"#VALUE!"},{"$error":"#VALUE!"},{"$error":"#VALUE!"},null,87,{"$error":"#VALUE!"},{"$error":"#VALUE!"}]
[88,null,{"$error":"#VALUE!"},{"$f":"E102*'Worksheet 1'!$I$44","v":{"$error":"#VALUE!"}},{"$f":"E101+F99","v":{"$error":"#VALUE!"}},null,0,{"$nulls":46},88,{"$error":"#VALUE!"},{"$error":"#VALUE!"},{"$error":"#VALUE!"},{"$error":"#VALUE!"},null,88,{"$error":"#VALUE!"},{"$error":"#VALUE!"}]
[89,null,{"$error":"#VALUE!"},{"$f":"E103*'Worksheet 1'!$I$44","v":{"$error":"#VALUE!"}},{"$f":"E102+F99","v":{"$error":"#VALUE!"}},null,0,{"$nulls":46},89,{"$error":"#VALUE!"},{"$error":"#VALUE!"},{"$error":"#VALUE!"},{"$error":"#VALUE!"},null,89,{"$error":"#VALUE!"},{"$error":"#VALUE!"}]
[90,null,{"$error":"#VALUE!"},{"$f":"E104*'Worksheet 1'!$I$44","v":{"$error":"#VALUE!"}},{"$f":"IF($B$10=\"N m\",B104/9.806/'Worksheet 1'!$I$44,IF($B$10=\"kg m\",B104/'Worksheet 1'!$I$44,IF($B$10=\"m\",B104,\"error\")))","v":"error"},{"$f":"(E109-E104)/5","v":{"$error":"#VALUE!"}},0,{"$nulls":46},90,"error","X",{"$error":"#VALUE!"},{"$error":"#VALUE!"},null,90,"error","X"]
[91,null,{"$error":"#VALUE!"},{"$f":"E105*'Worksheet 1'!$I$44","v":{"$error":"#VALUE!"}},{"$f":"E104+F104","v":{"$error":"#VALUE!"}},null,0,{"$nulls":46},91,{"$error":"#VALUE!"},{"$error":"#VALUE!"},{"$error":"#VALUE!"},{"$error":"#VALUE!"},null,91,{"$error":"#VALUE!"},{"$error":"#VALUE!"}]
[92,null,{"$error":"#VALUE!"},{"$f":"E106*'Worksheet 1'!$I$44","v":{"$error":"#VALUE!"}},{"$f":"E105+F104","v":{"$error":"#VALUE!"}},null,0,{"$nulls":46},92,{"$error":"#VALUE!"},{"$error":"#VALUE!"},{"$error":"#VALUE!"},{"$error":"#VALUE!"},null,92,{"$error":"#VALUE!"},{"$error":"#VALUE!"}]
[93,null,{"$error":"#VALUE!"},{"$f":"E107*'Worksheet 1'!$I$44","v":{"$error":"#VALUE!"}},{"$f":"E106+F104","v":{"$error":"#VALUE!"}},null,0,{"$nulls":46},93,{"$error":"#VALUE!"},{"$error":"#VALUE!"},{"$error":"#VALUE!"},{"$error":"#VALUE!"},null,93,{"$error":"#VALUE!"},{"$error":"#VALUE!"}]
[94,null,{"$error":"#VALUE!"},{"$f":"E108*'Worksheet 1'!$I$44","v":{"$error":"#VALUE!"}},{"$f":"E107+F104","v":{"$error":"#VALUE!"}},null,0,{"$nulls":46},94,{"$error":"#VALUE!"},{"$error":"#VALUE!"},{"$error":"#VALUE!"},{"$error":"#VALUE!"},null,94,{"$error":"#VALUE!"},{"$error":"#VALUE!"}]
[95,null,{"$error":"#VALUE!"},{"$f":"E109*'Worksheet 1'!$I$44","v":{"$error":"#VALUE!"}},{"$f":"IF($B$10=\"N m\",B109/9.806/'Worksheet 1'!$I$44,IF($B$10=\"kg m\",B109/'Worksheet 1'!$I$44,IF($B$10=\"m\",B109,\"error\")))","v":"error"},{"$f":"(E114-E109)/5","v":{"$error":"#VALUE!"}},0,{"$nulls":46},95,"error","X",{"$error":"#VALUE!"},{"$error":"#VALUE!"},null,95,"error","X"]
[96,null,{"$error":"#VALUE!"},{"$f":"E110*'Worksheet 1'!$I$44","v":{"$error":"#VALUE!"}},{"$f":"E109+F109","v":{"$error":"#VALUE!"}},null,0,{"$nulls":46},96,{"$error":"#VALUE!"},{"$error":"#VALUE!"},{"$error":"#VALUE!"},{"$error":"#VALUE!"},null,96,{"$error":"#VALUE!"},{"$error":"#VALUE!"}]
[97,null,{"$error":"#VALUE!"},{"$f":"E111*'Worksheet 1'!$I$44","v":{"$error":"#VALUE!"}},{"$f":"E110+F109","v":{"$error":"#VALUE!"}},null,0,{"$nulls":46},97,{"$error":"#VALUE!"},{"$error":"#VALUE!"},{"$error":"#VALUE!"},{"$error":"#VALUE!"},null,97,{"$error":"#VALUE!"},{"$error":"#VALUE!"}]
[98,null,{"$error":"#VALUE!"},{"$f":"E112*'Worksheet 1'!$I$44","v":{"$error":"#VALUE!"}},{"$f":"E111+F109","v":{"$error":"#VALUE!"}},null,0,{"$nulls":46},98,{"$error":"#VALUE!"},{"$error":"#VALUE!"},{"$error":"#VALUE!"},{"$error":"#VALUE!"},null,98,{"$error":"#VALUE!"},{"$error":"#VALUE!"}]
[99,null,{"$error":"#VALUE!"},{"$f":"E113*'Worksheet 1'!$I$44","v":{"$error":"#VALUE!"}},{"$f":"E112+F109","v":{"$error":"#VALUE!"}},null,0,{"$nulls":46},99,{"$error":"#VALUE!"},{"$error":"#VALUE!"},{"$error":"#VALUE!"},{"$error":"#VALUE!"},null,99,{"$error":"#VALUE!"},{"$error":"#VALUE!"}]
[100,null,{"$error":"#VALUE!"},{"$f":"E114*'Worksheet 1'!$I$44","v":{"$error":"#VALUE!"}},{"$f":"IF($B$10=\"N m\",B114/9.806/'Worksheet 1'!$I$44,IF($B$10=\"kg m\",B114/'Worksheet 1'!$I$44,IF($B$10=\"m\",B114,\"error\")))","v":"error"},{"$f":"(E119-E114)/5","v":{"$error":"#VALUE!"}},0,{"$nulls":46},100,"error","X",{"$error":"#VALUE!"},{"$error":"#VALUE!"},null,100,"error","X"]
[101,null,{"$error":"#VALUE!"},{"$f":"E115*'Worksheet 1'!$I$44","v":{"$error":"#VALUE!"}},{"$f":"E114+F114","v":{"$error":"#VALUE!"}},null,0,{"$nulls":46},101,{"$error":"#VALUE!"},{"$error":"#VALUE!"},{"$error":"#VALUE!"},{"$error":"#VALUE!"},null,101,{"$error":"#VALUE!"},{"$error":"#VALUE!"}]
[102,null,{"$error":"#VALUE!"},{"$f":"E116*'Worksheet 1'!$I$44","v":{"$error":"#VALUE!"}},{"$f":"E115+F114","v":{"$error":"#VALUE!"}},null,0,{"$nulls":46},102,{"$error":"#VALUE!"},{"$error":"#VALUE!"},{"$error":"#VALUE!"},{"$error":"#VALUE!"},null,102,{"$error":"#VALUE!"},{"$error":"#VALUE!"}]
[103,null,{"$error":"#VALUE!"},{"$f":"E117*'Worksheet 1'!$I$44","v":{"$error":"#VALUE!"}},{"$f":"E116+F114","v":{"$error":"#VALUE!"}},null,0,{"$nulls":46},103,{"$error":"#VALUE!"},{"$error":"#VALUE!"},{"$error":"#VALUE!"},{"$error":"#VALUE!"},null,103,{"$error":"#VALUE!"},{"$error":"#VALUE!"}]
[104,null,{"$error":"#VALUE!"},{"$f":"E118*'Worksheet 1'!$I$44","v":{"$error":"#VALUE!"}},{"$f":"E117+F114","v":{"$error":"#VALUE!"}},null,0,{"$nulls":46},104,{"$error":"#VALUE!"},{"$error":"#VALUE!"},{"$error":"#VALUE!"},{"$error":"#VALUE!"},null,104,{"$error":"#VALUE!"},{"$error":"#VALUE!"}]
[105,null,{"$error":"#VALUE!"},{"$f":"E119*'Worksheet 1'!$I$44","v":{"$error":"#VALUE!"}},{"$f":"IF($B$10=\"N m\",B119/9.806/'Worksheet 1'!$I$44,IF($B$10=\"kg m\",B119/'Worksheet 1'!$I$44,IF($B$10=\"m\",B119,\"error\")))","v":"error"},{"$f":"(E124-E119)/5","v":{"$error":"#VALUE!"}},0,{"$nulls":46},105,"error","X",{"$error":"#VALUE!"},{"$error":"#VALUE!"},null,105,"error","X"]
[106,null,{"$error":"#VALUE!"},{"$f":"E120*'Worksheet 1'!$I$44","v":{"$error":"#VALUE!"}},{"$f":"E119+F119","v":{"$error":"#VALUE!"}},null,0,{"$nulls":46},106,{"$error":"#VALUE!"},{"$error":"#VALUE!"},{"$error":"#VALUE!"},{"$error":"#VALUE!"},null,106,{"$error":"#VALUE!"},{"$error":"#VALUE!"}]
[107,null,{"$error":"#VALUE!"},{"$f":"E121*'Worksheet 1'!$I$44","v":{"$error":"#VALUE!"}},{"$f":"E120+F119","v":{"$error":"#VALUE!"}},null,0,{"$nulls":46},107,{"$error":"#VALUE!"},{"$error":"#VALUE!"},{"$error":"#VALUE!"},{"$error":"#VALUE!"},null,107,{"$error":"#VALUE!"},{"$error":"#VALUE!"}]
[108,null,{"$error":"#VALUE!"},{"$f":"E122*'Worksheet 1'!$I$44","v":{"$error":"#VALUE!"}},{"$f":"E121+F119","v":{"$error":"#VALUE!"}},null,0,{"$nulls":46},108,{"$error":"#VALUE!"},{"$error":"#VALUE!"},{"$error":"#VALUE!"},{"$error":"#VALUE!"},null,108,{"$error":"#VALUE!"},{"$error":"#VALUE!"}]
[109,null,{"$error":"#VALUE!"},{"$f":"E123*'Worksheet 1'!$I$44","v":{"$error":"#VALUE!"}},{"$f":"E122+F119","v":{"$error":"#VALUE!"}},null,0,{"$nulls":46},109,{"$error":"#VALUE!"},{"$error":"#VALUE!"},{"$error":"#VALUE!"},{"$error":"#VALUE!"},null,109,{"$error":"#VALUE!"},{"$error":"#VALUE!"}]
[110,null,{"$error":"#VALUE!"},{"$f":"E124*'Worksheet 1'!$I$44","v":{"$error":"#VALUE!"}},{"$f":"IF($B$10=\"N m\",B124/9.806/'Worksheet 1'!$I$44,IF($B$10=\"kg m\",B124/'Worksheet 1'!$I$44,IF($B$10=\"m\",B124,\"error\")))","v":"error"},{"$f":"(E129-E124)/5","v":{"$error":"#VALUE!"}},0,{"$nulls":46},110,"error","X",{"$error":"#VALUE!"},{"$error":"#VALUE!"},null,110,"error","X"]
[111,null,{"$error":"#VALUE!"},{"$f":"E125*'Worksheet 1'!$I$44","v":{"$error":"#VALUE!"}},{"$f":"E124+F124","v":{"$error":"#VALUE!"}},null,0,{"$nulls":46},111,{"$error":"#VALUE!"},{"$error":"#VALUE!"},{"$error":"#VALUE!"},{"$error":"#VALUE!"},null,111,{"$error":"#VALUE!"},{"$error":"#VALUE!"}]
[112,null,{"$error":"#VALUE!"},{"$f":"E126*'Worksheet 1'!$I$44","v":{"$error":"#VALUE!"}},{"$f":"E125+F124","v":{"$error":"#VALUE!"}},null,0,{"$nulls":46},112,{"$error":"#VALUE!"},{"$error":"#VALUE!"},{"$error":"#VALUE!"},{"$error":"#VALUE!"},null,112,{"$error":"#VALUE!"},{"$error":"#VALUE!"}]
[113,null,{"$error":"#VALUE!"},{"$f":"E127*'Worksheet 1'!$I$44","v":{"$error":"#VALUE!"}},{"$f":"E126+F124","v":{"$error":"#VALUE!"}},null,0,{"$nulls":46},113,{"$error":"#VALUE!"},{"$error":"#VALUE!"},{"$error":"#VALUE!"},{"$error":"#VALUE!"},null,113,{"$error":"#VALUE!"},{"$error":"#VALUE!"}]
[114,null,{"$error":"#VALUE!"},{"$f":"E128*'Worksheet 1'!$I$44","v":{"$error":"#VALUE!"}},{"$f":"E127+F124","v":{"$error":"#VALUE!"}},null,0,{"$nulls":46},114,{"$error":"#VALUE!"},{"$error":"#VALUE!"},{"$error":"#VALUE!"},{"$error":"#VALUE!"},null,114,{"$error":"#VALUE!"},{"$error":"#VALUE!"}]
[115,null,{"$error":"#VALUE!"},{"$f":"E129*'Worksheet 1'!$I$44","v":{"$error":"#VALUE!"}},{"$f":"IF($B$10=\"N m\",B129/9.806/'Worksheet 1'!$I$44,IF($B$10=\"kg m\",B129/'Worksheet 1'!$I$44,IF($B$10=\"m\",B129,\"error\")))","v":"error"},{"$f":"(E134-E129)/5","v":{"$error":"#VALUE!"}},0,{"$nulls":46},115,"error","X",{"$error":"#VALUE!"},{"$error":"#VALUE!"},null,115,"error","X"]
[116,null,{"$error":"#VALUE!"},{"$f":"E130*'Worksheet 1'!$I$44","v":{"$error":"#VALUE!"}},{"$f":"E129+F129","v":{"$error":"#VALUE!"}},null,0,{"$nulls":46},116,{"$error":"#VALUE!"},{"$error":"#VALUE!"},{"$error":"#VALUE!"},{"$error":"#VALUE!"},null,116,{"$error":"#VALUE!"},{"$error":"#VALUE!"}]
[117,null,{"$error":"#VALUE!"},{"$f":"E131*'Worksheet 1'!$I$44","v":{"$error":"#VALUE!"}},{"$f":"E130+F129","v":{"$error":"#VALUE!"}},null,0,{"$nulls":46},117,{"$error":"#VALUE!"},{"$error":"#VALUE!"},{"$error":"#VALUE!"},{"$error":"#VALUE!"},null,117,{"$error":"#VALUE!"},{"$error":"#VALUE!"}]
[118,null,{"$error":"#VALUE!"},{"$f":"E132*'Worksheet 1'!$I$44","v":{"$error":"#VALUE!"}},{"$f":"E131+F129","v":{"$error":"#VALUE!"}},null,0,{"$nulls":46},118,{"$error":"#VALUE!"},{"$error":"#VALUE!"},{"$error":"#VALUE!"},{"$error":"#VALUE!"},null,118,{"$error":"#VALUE!"},{"$error":"#VALUE!"}]
[119,null,{"$error":"#VALUE!"},{"$f":"E133*'Worksheet 1'!$I$44","v":{"$error":"#VALUE!"}},{"$f":"E132+F129","v":{"$error":"#VALUE!"}},null,0,{"$nulls":46},119,{"$error":"#VALUE!"},{"$error":"#VALUE!"},{"$error":"#VALUE!"},{"$error":"#VALUE!"},null,119,{"$error":"#VALUE!"},{"$error":"#VALUE!"}]
[120,null,{"$error":"#VALUE!"},{"$f":"E134*'Worksheet 1'!$I$44","v":{"$error":"#VALUE!"}},{"$f":"IF($B$10=\"N m\",B134/9.806/'Worksheet 1'!$I$44,IF($B$10=\"kg m\",B134/'Worksheet 1'!$I$44,IF($B$10=\"m\",B134,\"error\")))","v":"error"},{"$f":"(E139-E134)/5","v":{"$error":"#VALUE!"}},0,{"$nulls":46},120,"error","X",{"$error":"#VALUE!"},{"$error":"#VALUE!"},null,120,"error","X"]
[121,null,{"$error":"#VALUE!"},{"$f":"E135*'Worksheet 1'!$I$44","v":{"$error":"#VALUE!"}},{"$f":"E134+F134","v":{"$error":"#VALUE!"}},null,0,{"$nulls":46},121,{"$error":"#VALUE!"},{"$error":"#VALUE!"},{"$error":"#VALUE!"},{"$error":"#VALUE!"},null,121,{"$error":"#VALUE!"},{"$error":"#VALUE!"}]
[122,null,{"$error":"#VALUE!"},{"$f":"E136*'Worksheet 1'!$I$44","v":{"$error":"#VALUE!"}},{"$f":"E135+F134","v":{"$error":"#VALUE!"}},null,0,{"$nulls":46},122,{"$error":"#VALUE!"},{"$error":"#VALUE!"},{"$error":"#VALUE!"},{"$error":"#VALUE!"},null,122,{"$error":"#VALUE!"},{"$error":"#VALUE!"}]
[123,null,{"$error":"#VALUE!"},{"$f":"E137*'Worksheet 1'!$I$44","v":{"$error":"#VALUE!"}},{"$f":"E136+F134","v":{"$error":"#VALUE!"}},null,0,{"$nulls":46},123,{"$error":"#VALUE!"},{"$error":"#VALUE!"},{"$error":"#VALUE!"},{"$error":"#VALUE!"},null,123,{"$error":"#VALUE!"},{"$error":"#VALUE!"}]
[124,null,{"$error":"#VALUE!"},{"$f":"E138*'Worksheet 1'!$I$44","v":{"$error":"#VALUE!"}},{"$f":"E137+F134","v":{"$error":"#VALUE!"}},null,0,{"$nulls":46},124,{"$error":"#VALUE!"},{"$error":"#VALUE!"},{"$error":"#VALUE!"},{"$error":"#VALUE!"},null,124,{"$error":"#VALUE!"},{"$error":"#VALUE!"}]
[125,null,{"$error":"#VALUE!"},{"$f":"E139*'Worksheet 1'!$I$44","v":{"$error":"#VALUE!"}},{"$f":"IF($B$10=\"N m\",B139/9.806/'Worksheet 1'!$I$44,IF($B$10=\"kg m\",B139/'Worksheet 1'!$I$44,IF($B$10=\"m\",B139,\"error\")))","v":"error"},{"$f":"(E144-E139)/5","v":{"$error":"#VALUE!"}},0,{"$nulls":46},125,"error","X",{"$error":"#VALUE!"},{"$error":"#VALUE!"},null,125,"error","X"]
[126,null,{"$error":"#VALUE!"},{"$f":"E140*'Worksheet 1'!$I$44","v":{"$error":"#VALUE!"}},{"$f":"E139+F139","v":{"$error":"#VALUE!"}},null,0,{"$nulls":46},126,{"$error":"#VALUE!"},{"$error":"#VALUE!"},{"$error":"#VALUE!"},{"$error":"#VALUE!"},null,126,{"$error":"#VALUE!"},{"$error":"#VALUE!"}]
[127,null,{"$error":"#VALUE!"},{"$f":"E141*'Worksheet 1'!$I$44","v":{"$error":"#VALUE!"}},{"$f":"E140+F139","v":{"$error":"#VALUE!"}},null,0,{"$nulls":46},127,{"$error":"#VALUE!"},{"$error":"#VALUE!"},{"$error":"#VALUE!"},{"$error":"#VALUE!"},null,127,{"$error":"#VALUE!"},{"$error":"#VALUE!"}]
[128,null,{"$f":"D142*9.806","v":{"$error":"#VALUE!"}},{"$f":"E142*'Worksheet 1'!$I$44","v":{"$error":"#VALUE!"}},{"$f":"E141+F139","v":{"$error":"#VALUE!"}},null,0,{"$nulls":46},128,{"$f":"E142","v":{"$error":"#VALUE!"}},{"$error":"#VALUE!"},{"$f":"IF(AND(BD142=\"X\",BD143=\"\"),BB142,\"\")","v":{"$error":"#VALUE!"}},{"$error":"#VALUE!"},null,128,{"$error":"#VALUE!"},{"$f":"IF(BI142>=0,\"X\",\"\")","v":{"$error":"#VALUE!"}}]
[129,null,{"$error":"#VALUE!"},{"$f":"E143*'Worksheet 1'!$I$44","v":{"$error":"#VALUE!"}},{"$f":"E142+F139","v":{"$error":"#VALUE!"}},null,0,{"$nulls":46},129,{"$error":"#VALUE!"},{"$f":"IF(BC143>0,\"X\",\"\")","v":{"$error":"#VALUE!"}},{"$error":"#VALUE!"},{"$f":"IF(AND(BB143<=$BC$177,BD143=\"X\"),E143,\"\")","v":{"$error":"#VALUE!"}},null,129,{"$f":"IF(E143>=0,E143,\"\")","v":{"$error":"#VALUE!"}},{"$error":"#VALUE!"}]
[130,null,{"$error":"#VALUE!"},{"$f":"E144*'Worksheet 1'!$I$44","v":{"$error":"#VALUE!"}},{"$f":"IF($B$10=\"N m\",B144/9.806/'Worksheet 1'!$I$44,IF($B$10=\"kg m\",B144/'Worksheet 1'!$I$44,IF($B$10=\"m\",B144,\"error\")))","v":"error"},{"$f":"(E149-E144)/5","v":{"$error":"#VALUE!"}},0,{"$nulls":46},130,"error","X",{"$error":"#VALUE!"},{"$error":"#VALUE!"},null,130,"error","X"]
[131,null,{"$error":"#VALUE!"},{"$f":"E145*'Worksheet 1'!$I$44","v":{"$error":"#VALUE!"}},{"$f":"E144+F144","v":{"$error":"#VALUE!"}},null,0,{"$nulls":46},131,{"$error":"#VALUE!"},{"$error":"#VALUE!"},{"$error":"#VALUE!"},{"$error":"#VALUE!"},null,131,{"$error":"#VALUE!"},{"$error":"#VALUE!"}]
[132,null,{"$error":"#VALUE!"},{"$f":"E146*'Worksheet 1'!$I$44","v":{"$error":"#VALUE!"}},{"$f":"E145+F144","v":{"$error":"#VALUE!"}},null,0,{"$nulls":46},132,{"$error":"#VALUE!"},{"$error":"#VALUE!"},{"$error":"#VALUE!"},{"$error":"#VALUE!"},null,132,{"$error":"#VALUE!"},{"$error":"#VALUE!"}]
[133,null,{"$error":"#VALUE!"},{"$f":"E147*'Worksheet 1'!$I$44","v":{"$error":"#VALUE!"}},{"$f":"E146+F144","v":{"$error":"#VALUE!"}},null,0,{"$nulls":46},133,{"$error":"#VALUE!"},{"$error":"#VALUE!"},{"$error":"#VALUE!"},{"$error":"#VALUE!"},null,133,{"$error":"#VALUE!"},{"$error":"#VALUE!"}]
[134,null,{"$error":"#VALUE!"},{"$f":"E148*'Worksheet 1'!$I$44","v":{"$error":"#VALUE!"}},{"$f":"E147+F144","v":{"$error":"#VALUE!"}},null,0,{"$nulls":46},134,{"$error":"#VALUE!"},{"$error":"#VALUE!"},{"$error":"#VALUE!"},{"$error":"#VALUE!"},null,134,{"$error":"#VALUE!"},{"$error":"#VALUE!"}]
[135,null,{"$error":"#VALUE!"},{"$f":"E149*'Worksheet 1'!$I$44","v":{"$error":"#VALUE!"}},{"$f":"IF($B$10=\"N m\",B149/9.806/'Worksheet 1'!$I$44,IF($B$10=\"kg m\",B149/'Worksheet 1'!$I$44,IF($B$10=\"m\",B149,\"error\")))","v":"error"},{"$f":"(E154-E149)/5","v":{"$error":"#VALUE!"}},0,{"$nulls":46},135,"error","X",{"$error":"#VALUE!"},{"$error":"#VALUE!"},null,135,"error","X"]
[136,null,{"$error":"#VALUE!"},{"$f":"E150*'Worksheet 1'!$I$44","v":{"$error":"#VALUE!"}},{"$f":"E149+F149","v":{"$error":"#VALUE!"}},null,0,{"$nulls":46},136,{"$error":"#VALUE!"},{"$error":"#VALUE!"},{"$error":"#VALUE!"},{"$error":"#VALUE!"},null,136,{"$error":"#VALUE!"},{"$error":"#VALUE!"}]
[137,null,{"$error":"#VALUE!"},{"$f":"E151*'Worksheet 1'!$I$44","v":{"$error":"#VALUE!"}},{"$f":"E150+F149","v":{"$error":"#VALUE!"}},null,0,{"$nulls":46},137,{"$error":"#VALUE!"},{"$error":"#VALUE!"},{"$error":"#VALUE!"},{"$error":"#VALUE!"},null,137,{"$error":"#VALUE!"},{"$error":"#VALUE!"}]
[138,null,{"$error":"#VALUE!"},{"$f":"E152*'Worksheet 1'!$I$44","v":{"$error":"#VALUE!"}},{"$f":"E151+F149","v":{"$error":"#VALUE!"}},null,0,{"$nulls":46},138,{"$error":"#VALUE!"},{"$error":"#VALUE!"},{"$error":"#VALUE!"},{"$error":"#VALUE!"},null,138,{"$error":"#VALUE!"},{"$error":"#VALUE!"}]
[139,null,{"$error":"#VALUE!"},{"$f":"E153*'Worksheet 1'!$I$44","v":{"$error":"#VALUE!"}},{"$f":"E152+F149","v":{"$error":"#VALUE!"}},null,0,{"$nulls":46},139,{"$error":"#VALUE!"},{"$error":"#VALUE!"},{"$error":"#VALUE!"},{"$error":"#VALUE!"},null,139,{"$error":"#VALUE!"},{"$error":"#VALUE!"}]
[140,null,{"$error":"#VALUE!"},{"$f":"E154*'Worksheet 1'!$I$44","v":{"$error":"#VALUE!"}},{"$f":"IF($B$10=\"N m\",B154/9.806/'Worksheet 1'!$I$44,IF($B$10=\"kg m\",B154/'Worksheet 1'!$I$44,IF($B$10=\"m\",B154,\"error\")))","v":"error"},{"$f":"(E159-E154)/5","v":{"$error":"#VALUE!"}},0,{"$nulls":46},140,"error","X",{"$error":"#VALUE!"},{"$error":"#VALUE!"},null,140,"error","X"]
[141,null,{"$error":"#VALUE!"},{"$f":"E155*'Worksheet 1'!$I$44","v":{"$error":"#VALUE!"}},{"$f":"E154+F154","v":{"$error":"#VALUE!"}},null,0,{"$nulls":46},141,{"$error":"#VALUE!"},{"$error":"#VALUE!"},{"$error":"#VALUE!"},{"$error":"#VALUE!"},null,141,{"$error":"#VALUE!"},{"$error":"#VALUE!"}]
[142,null,{"$error":"#VALUE!"},{"$f":"E156*'Worksheet 1'!$I$44","v":{"$error":"#VALUE!"}},{"$f":"E155+F154","v":{"$error":"#VALUE!"}},null,0,{"$nulls":46},142,{"$error":"#VALUE!"},{"$error":"#VALUE!"},{"$error":"#VALUE!"},{"$error":"#VALUE!"},null,142,{"$error":"#VALUE!"},{"$error":"#VALUE!"}]
[143,null,{"$error":"#VALUE!"},{"$f":"E157*'Worksheet 1'!$I$44","v":{"$error":"#VALUE!"}},{"$f":"E156+F154","v":{"$error":"#VALUE!"}},null,0,{"$nulls":46},143,{"$error":"#VALUE!"},{"$error":"#VALUE!"},{"$error":"#VALUE!"},{"$error":"#VALUE!"},null,143,{"$error":"#VALUE!"},{"$error":"#VALUE!"}]
[144,null,{"$error":"#VALUE!"},{"$f":"E158*'Worksheet 1'!$I$44","v":{"$error":"#VALUE!"}},{"$f":"E157+F154","v":{"$error":"#VALUE!"}},null,0,{"$nulls":46},144,{"$error":"#VALUE!"},{"$error":"#VALUE!"},{"$error":"#VALUE!"},{"$error":"#VALUE!"},null,144,{"$error":"#VALUE!"},{"$error":"#VALUE!"}]
[145,null,{"$error":"#VALUE!"},{"$f":"E159*'Worksheet 1'!$I$44","v":{"$error":"#VALUE!"}},{"$f":"IF($B$10=\"N m\",B159/9.806/'Worksheet 1'!$I$44,IF($B$10=\"kg m\",B159/'Worksheet 1'!$I$44,IF($B$10=\"m\",B159,\"error\")))","v":"error"},{"$f":"(E164-E159)/5","v":{"$error":"#VALUE!"}},0,{"$nulls":46},145,"error","X",{"$error":"#VALUE!"},{"$error":"#VALUE!"},null,145,"error","X"]
[146,null,{"$error":"#VALUE!"},{"$f":"E160*'Worksheet 1'!$I$44","v":{"$error":"#VALUE!"}},{"$f":"E159+F159","v":{"$error":"#VALUE!"}},null,0,{"$nulls":46},146,{"$error":"#VALUE!"},{"$error":"#VALUE!"},{"$error":"#VALUE!"},{"$error":"#VALUE!"},null,146,{"$error":"#VALUE!"},{"$error":"#VALUE!"}]
[147,null,{"$error":"#VALUE!"},{"$f":"E161*'Worksheet 1'!$I$44","v":{"$error":"#VALUE!"}},{"$f":"E160+F159","v":{"$error":"#VALUE!"}},null,0,{"$nulls":46},147,{"$error":"#VALUE!"},{"$error":"#VALUE!"},{"$error":"#VALUE!"},{"$error":"#VALUE!"},null,147,{"$error":"#VALUE!"},{"$error":"#VALUE!"}]
[148,null,{"$error":"#VALUE!"},{"$f":"E162*'Worksheet 1'!$I$44","v":{"$error":"#VALUE!"}},{"$f":"E161+F159","v":{"$error":"#VALUE!"}},null,0,{"$nulls":46},148,{"$error":"#VALUE!"},{"$error":"#VALUE!"},{"$error":"#VALUE!"},{"$error":"#VALUE!"},null,148,{"$error":"#VALUE!"},{"$error":"#VALUE!"}]
[149,null,{"$error":"#VALUE!"},{"$f":"E163*'Worksheet 1'!$I$44","v":{"$error":"#VALUE!"}},{"$f":"E162+F159","v":{"$error":"#VALUE!"}},null,0,{"$nulls":46},149,{"$error":"#VALUE!"},{"$error":"#VALUE!"},{"$error":"#VALUE!"},{"$error":"#VALUE!"},null,149,{"$error":"#VALUE!"},{"$error":"#VALUE!"}]
[150,null,{"$error":"#VALUE!"},{"$f":"E164*'Worksheet 1'!$I$44","v":{"$error":"#VALUE!"}},{"$f":"IF($B$10=\"N m\",B164/9.806/'Worksheet 1'!$I$44,IF($B$10=\"kg m\",B164/'Worksheet 1'!$I$44,IF($B$10=\"m\",B164,\"error\")))","v":"error"},{"$f":"(E169-E164)/5","v":{"$error":"#VALUE!"}},0,{"$nulls":46},150,"error","X",{"$error":"#VALUE!"},{"$error":"#VALUE!"},null,150,"error","X"]
[151,null,{"$error":"#VALUE!"},{"$f":"E165*'Worksheet 1'!$I$44","v":{"$error":"#VALUE!"}},{"$f":"E164+F164","v":{"$error":"#VALUE!"}},null,0,{"$nulls":46},151,{"$error":"#VALUE!"},{"$error":"#VALUE!"},{"$error":"#VALUE!"},{"$error":"#VALUE!"},null,151,{"$error":"#VALUE!"},{"$error":"#VALUE!"}]
[152,null,{"$error":"#VALUE!"},{"$f":"E166*'Worksheet 1'!$I$44","v":{"$error":"#VALUE!"}},{"$f":"E165+F164","v":{"$error":"#VALUE!"}},null,0,{"$nulls":46},152,{"$error":"#VALUE!"},{"$error":"#VALUE!"},{"$error":"#VALUE!"},{"$error":"#VALUE!"},null,152,{"$error":"#VALUE!"},{"$error":"#VALUE!"}]
[153,null,{"$error":"#VALUE!"},{"$f":"E167*'Worksheet 1'!$I$44","v":{"$error":"#VALUE!"}},{"$f":"E166+F164","v":{"$error":"#VALUE!"}},null,0,{"$nulls":46},153,{"$error":"#VALUE!"},{"$error":"#VALUE!"},{"$error":"#VALUE!"},{"$error":"#VALUE!"},null,153,{"$error":"#VALUE!"},{"$error":"#VALUE!"}]
[154,null,{"$error":"#VALUE!"},{"$f":"E168*'Worksheet 1'!$I$44","v":{"$error":"#VALUE!"}},{"$f":"E167+F164","v":{"$error":"#VALUE!"}},null,0,{"$nulls":46},154,{"$error":"#VALUE!"},{"$error":"#VALUE!"},{"$error":"#VALUE!"},{"$error":"#VALUE!"},null,154,{"$error":"#VALUE!"},{"$error":"#VALUE!"}]
[155,null,{"$error":"#VALUE!"},{"$f":"E169*'Worksheet 1'!$I$44","v":{"$error":"#VALUE!"}},{"$f":"IF($B$10=\"N m\",B169/9.806/'Worksheet 1'!$I$44,IF($B$10=\"kg m\",B169/'Worksheet 1'!$I$44,IF($B$10=\"m\",B169,\"error\")))","v":"error"},{"$f":"(E174-E169)/5","v":{"$error":"#VALUE!"}},0,{"$nulls":46},155,"error","X",{"$error":"#VALUE!"},{"$error":"#VALUE!"},null,155,"error","X"]
[156,null,{"$error":"#VALUE!"},{"$f":"E170*'Worksheet 1'!$I$44","v":{"$error":"#VALUE!"}},{"$f":"E169+F169","v":{"$error":"#VALUE!"}},null,0,{"$nulls":46},156,{"$error":"#VALUE!"},{"$error":"#VALUE!"},{"$error":"#VALUE!"},{"$error":"#VALUE!"},null,156,{"$error":"#VALUE!"},{"$error":"#VALUE!"}]
[157,null,{"$error":"#VALUE!"},{"$f":"E171*'Worksheet 1'!$I$44","v":{"$error":"#VALUE!"}},{"$f":"E170+F169","v":{"$error":"#VALUE!"}},null,0,{"$nulls":46},157,{"$error":"#VALUE!"},{"$error":"#VALUE!"},{"$error":"#VALUE!"},{"$error":"#VALUE!"},null,157,{"$error":"#VALUE!"},{"$error":"#VALUE!"}]
[158,null,{"$error":"#VALUE!"},{"$f":"E172*'Worksheet 1'!$I$44","v":{"$error":"#VALUE!"}},{"$f":"E171+F169","v":{"$error":"#VALUE!"}},null,0,{"$nulls":46},158,{"$error":"#VALUE!"},{"$error":"#VALUE!"},{"$error":"#VALUE!"},{"$error":"#VALUE!"},null,158,{"$error":"#VALUE!"},{"$error":"#VALUE!"}]
[159,null,{"$error":"#VALUE!"},{"$f":"E173*'Worksheet 1'!$I$44","v":{"$error":"#VALUE!"}},{"$f":"E172+F169","v":{"$error":"#VALUE!"}},null,0,{"$nulls":46},159,{"$error":"#VALUE!"},{"$error":"#VALUE!"},{"$error":"#VALUE!"},{"$error":"#VALUE!"},null,159,{"$error":"#VALUE!"},{"$error":"#VALUE!"}]
[160,null,{"$error":"#VALUE!"},{"$f":"E174*'Worksheet 1'!$I$44","v":{"$error":"#VALUE!"}},{"$f":"IF($B$10=\"N m\",B174/9.806/'Worksheet 1'!$I$44,IF($B$10=\"kg m\",B174/'Worksheet 1'!$I$44,IF($B$10=\"m\",B174,\"error\")))","v":"error"},{"$f":"(E179-E174)/5","v":{"$error":"#VALUE!"}},0,{"$nulls":46},160,"error",{"$f":"IF(BC174>0,\"X\",\"\")","v":"X"},160,{"$error":"#VALUE!"},null,160,{"$f":"IF(E174=\"\",\"\",IF(E174>=0,E174,\"\"))","v":"error"},"X"]
[]
["Angle of vanishing stability",null,null,"Area under GZ curve",{"$nulls":50},"Bestimmung Phi V",null,null,"Fläche"]
[{"$f":"BC184","v":{"$error":"#VALUE!"}},null,"degrees",{"$f":"BF177","v":{"$error":"#VALUE!"}},{"$nulls":3},"m deg",{"$nulls":46},{"$f":"MAX(BE14:BE174)","v":{"$error":"#VALUE!"}},{"$f":"LOOKUP(BC177,$BB$14:$BB$174,$BC$14:$BC$174)","v":{"$error":"#VALUE!"}},null,{"$f":"SUM(BF14:BF174)","v":{"$error":"#VALUE!"}}]
[{"$nulls":54},{"$f":"BC177+1","v":{"$error":"#VALUE!"}},{"$f":"LOOKUP(BC178,$BB$14:$BB$174,$BC$14:$BC$174)","v":{"$error":"#VALUE!"}}]
[]
[{"$nulls":54},"Nachkommastelle Phi V"]
[{"$nulls":54},{"$f":"(-1)*BD177/((-1)*BD177+BD178)","v":{"$error":"#VALUE!"}}]
[]
[{"$nulls":54},"Phi V"]
[{"$nulls":54},{"$f":"BC177+BC181","v":{"$error":"#VALUE!"}}]

{"sheet":"Worksheet 6b","index":10,"n_rows":184,"n_cols":62,"rows_kept":184,"merged":[[0,14,0,15],[2,0,2,10],[4,0,4,10],[175,0,175,1],[175,3,175,4],[176,0,176,1],[176,3,176,4]]}
[{"$nulls":14},"Comments"]
[{"$nulls":15},"Derived values"]
["ISO 12217-2:2017   CALCULATION WORKSHEET No. 6b    curve of righting moment mLA",{"$nulls":14},"Input values"]
[]
[{"$f":"CONCATENATE(coverSheet!B5,\"          \",coverSheet!B12)","v":"          "}]
[{"$nulls":48},"list:"]
["insert curve of righting moment in 5° steps in one of following units:",{"$nulls":47},"MW1"]
[null,"N m","kg m","m",{"$nulls":44},"MW2"]
[]
["chosen unit"]
[]
[]
["heeling angle[°]","insert Heeling Arm/Moment [Nm, kg m, m]","Heeling Moment [Nm]","Heeling Moment \n[kg m]","Arm Gz \n[m]","Diff(B-A/5)","Basis",{"$nulls":46},"heeling angle[°]","Arm\n[m]","Check > 0",null,"Flächenberechnung",null,null,"Arm [m]"]
[0,null,{"$f":"D14*9.806","v":{"$error":"#VALUE!"}},{"$f":"E14*'Worksheet 1'!$I$37","v":{"$error":"#VALUE!"}},{"$f":"IF($B$10=\"N m\",B14/9.806/'Worksheet 1'!$I$37,IF($B$10=\"kg m\",B14/'Worksheet 1'!$I$37,IF($B$10=\"m\",B14,\"error\")))","v":"error"},{"$f":"(E19-E14)/5","v":{"$error":"#VALUE!"}},0,{"$nulls":46},0,{"$f":"E14","v":"error"},{"$f":"IF(BC14>=0,\"X\",\"\")","v":"X"},{"$f":"IF(AND(BD14=\"X\",BD15=\"\"),BB14,\"\")","v":{"$error":"#VALUE!"}},{"$f":"IF(AND(BB14<=$BC$177,BD14=\"X\"),E14,\"\")","v":{"$error":"#VALUE!"}},null,0,{"$f":"IF(E14>=0,E14,\"\")","v":"error"},{"$f":"IF(BI14>=0,\"X\",\"\")","v":"X"}]
[1,null,{"$error":"#VALUE!"},{"$f":"E15*'Worksheet 1'!$I$37","v":{"$error":"#VALUE!"}},{"$f":"E14+F14","v":{"$error":"#VALUE!"}},null,0,{"$nulls":46},1,{"$error":"#VALUE!"},{"$f":"IF(BC15>0,\"X\",\"\")","v":{"$error":"#VALUE!"}},{"$error":"#VALUE!"},{"$f":"IF(AND(BB15<=$BC$177,BD15=\"X\"),E15,\"\")","v":{"$error":"#VALUE!"}},null,1,{"$f":"IF(E15>=0,E15,\"\")","v":{"$error":"#VALUE!"}},{"$error":"#VALUE!"}]
[2,null,{"$error":"#VALUE!"},{"$f":"E16*'Worksheet 1'!$I$37","v":{"$error":"#VALUE!"}},{"$f":"E15+F14","v":{"$error":"#VALUE!"}},null,0,{"$nulls":46},2,{"$error":"#VALUE!"},{"$error":"#VALUE!"},{"$error":"#VALUE!"},{"$error":"#VALUE!"},null,2,{"$error":"#VALUE!"},{"$error":"#VALUE!"}]
[3,null,{"$error":"#VALUE!"},{"$f":"E17*'Worksheet 1'!$I$37","v":{"$error":"#VALUE!"}},{"$f":"E16+F14","v":{"$error":"#VALUE!"}},null,0,{"$nulls":46},3,{"$error":"#VALUE!"},{"$error":"#VALUE!"},{"$error":"#VALUE!"},{"$error":"#VALUE!"},null,3,{"$error":"#VALUE!"},{"$error":"#VALUE!"}]
[4,null,{"$error":"#VALUE!"},{"$f":"E18*'Worksheet 1'!$I$37","v":{"$error":"#VALUE!"}},{"$f":"E17+F14","v":{"$error":"#VALUE!"}},null,0,{"$nulls":46},4,{"$error":"#VALUE!"},{"$error":"#VALUE!"},{"$error":"#VALUE!"},{"$error":"#VALUE!"},null,4,{"$error":"#VALUE!"},{"$error":"#VALUE!"}]
[5,null,{"$error":"#VALUE!"},{"$f":"E19*'Worksheet 1'!$I$37","v":{"$error":"#VALUE!"}},{"$f":"IF($B$10=\"N m\",B19/9.806/'Worksheet 1'!$I$37,IF($B$10=\"kg m\",B19/'Worksheet 1'!$I$37,IF($B$10=\"m\",B19,\"error\")))","v":"error"},{"$f":"(E24-E19)/5","v":{"$error":"#VALUE!"}},0,{"$nulls":46},5,"error","X",{"$error":"#VALUE!"},{"$error":"#VALUE!"},null,5,"error","X"]
[6,null,{"$error":"#VALUE!"},{"$f":"E20*'Worksheet 1'!$I$37","v":{"$error":"#VALUE!"}},{"$f":"E19+F19","v":{"$error":"#VALUE!"}},null,0,{"$nulls":46},6,{"$error":"#VALUE!"},{"$error":"#VALUE!"},{"$error":"#VALUE!"},{"$error":"#VALUE!"},null,6,{"$error":"#VALUE!"},{"$error":"#VALUE!"}]
[7,null,{"$error":"#VALUE!"},{"$f":"E21*'Worksheet 1'!$I$37","v":{"$error":"#VALUE!"}},{"$f":"E20+F19","v":{"$error":"#VALUE!"}},null,0,{"$nulls":46},7,{"$error":"#VALUE!"},{"$error":"#VALUE!"},{"$error":"#VALUE!"},{"$error":"#VALUE!"},null,7,{"$error":"#VALUE!"},{"$error":"#VALUE!"}]
[8,null,{"$error":"#VALUE!"},{"$f":"E22*'Worksheet 1'!$I$37","v":{"$error":"#VALUE!"}},{"$f":"E21+F19","v":{"$error":"#VALUE!"}},null,0,{"$nulls":46},8,{"$error":"#VALUE!"},{"$error":"#VALUE!"},{"$error":"#VALUE!"},{"$error":"#VALUE!"},null,8,{"$error":"#VALUE!"},{"$error":"#VALUE!"}]
[9,null,{"$error":"#VALUE!"},{"$f":"E23*'Worksheet 1'!$I$37","v":{"$error":"#VALUE!"}},{"$f":"E22+F19","v":{"$error":"#VALUE!"}},null,0,{"$nulls":46},9,{"$error":"#VALUE!"},{"$error":"#VALUE!"},{"$error":"#VALUE!"},{"$error":"#VALUE!"},null,9,{"$error":"#VALUE!"},{"$error":"#VALUE!"}]
[10,null,{"$error":"#VALUE!"},{"$f":"E24*'Worksheet 1'!$I$37","v":{"$error":"#VALUE!"}},{"$f":"IF($B$10=\"N m\",B24/9.806/'Worksheet 1'!$I$37,IF($B$10=\"kg m\",B24/'Worksheet 1'!$I$37,IF($B$10=\"m\",B24,\"error\")))","v":"error"},{"$f":"(E29-E24)/5","v":{"$error":"#VALUE!"}},0,{"$nulls":46},10,"error","X",{"$error":"#VALUE!"},{"$error":"#VALUE!"},null,10,"error","X"]
[11,null,{"$error":"#VALUE!"},{"$f":"E25*'Worksheet 1'!$I$37","v":{"$error":"#VALUE!"}},{"$f":"E24+F24","v":{"$error":"#VALUE!"}},null,0,{"$nulls":46},11,{"$error":"#VALUE!"},{"$error":"#VALUE!"},{"$error":"#VALUE!"},{"$error":"#VALUE!"},null,11,{"$error":"#VALUE!"},{"$error":"#VALUE!"}]
[12,null,{"$error":"#VALUE!"},{"$f":"E26*'Worksheet 1'!$I$37","v":{"$error":"#VALUE!"}},{"$f":"E25+F24","v":{"$error":"#VALUE!"}},null,0,{"$nulls":46},12,{"$error":"#VALUE!"},{"$error":"#VALUE!"},{"$error":"#VALUE!"},{"$error":"#VALUE!"},null,12,{"$error":"#VALUE!"},{"$error":"#VALUE!"}]
[13,null,{"$error":"#VALUE!"},{"$f":"E27*'Worksheet 1'!$I$37","v":{"$error":"#VALUE!"}},{"$f":"E26+F24","v":{"$error":"#VALUE!"}},null,0,{"$nulls":46},13,{"$error":"#VALUE!"},{"$error":"#VALUE!"},{"$error":"#VALUE!"},{"$error":"#VALUE!"},null,13,{"$error":"#VALUE!"},{"$error":"#VALUE!"}]
[14,null,{"$error":"#VALUE!"},{"$f":"E28*'Worksheet 1'!$I$37","v":{"$error":"#VALUE!"}},{"$f":"E27+F24","v":{"$error":"#VALUE!"}},null,0,{"$nulls":46},14,{"$error":"#VALUE!"},{"$error":"#VALUE!"},{"$error":"#VALUE!"},{"$error":"#VALUE!"},null,14,{"$error":"#VALUE!"},{"$error":"#VALUE!"}]
[15,null,{"$error":"#VALUE!"},{"$f":"E29*'Worksheet 1'!$I$37","v":{"$error":"#VALUE!"}},{"$f":"IF($B$10=\"N m\",B29/9.806/'Worksheet 1'!$I$37,IF($B$10=\"kg m\",B29/'Worksheet 1'!$I$37,IF($B$10=\"m\",B29,\"error\")))","v":"error"},{"$f":"(E34-E29)/5","v":{"$error":"#VALUE!"}},0,{"$nulls":46},15,"error","X",{"$error":"#VALUE!"},{"$error":"#VALUE!"},null,15,"error","X"]
[16,null,{"$error":"#VALUE!"},{"$f":"E30*'Worksheet 1'!$I$37","v":{"$error":"#VALUE!"}},{"$f":"E29+F29","v":{"$error":"#VALUE!"}},null,0,{"$nulls":46},16,{"$error":"#VALUE!"},{"$error":"#VALUE!"},{"$error":"#VALUE!"},{"$error":"#VALUE!"},null,16,{"$error":"#VALUE!"},{"$error":"#VALUE!"}]
[17,null,{"$error":"#VALUE!"},{"$f":"E31*'Worksheet 1'!$I$37","v":{"$error":"#VALUE!"}},{"$f":"E30+F29","v":{"$error":"#VALUE!"}},null,0,{"$nulls":46},17,{"$error":"#VALUE!"},{"$error":"#VALUE!"},{"$error":"#VALUE!"},{"$error":"#VALUE!"},null,17,{"$error":"#VALUE!"},{"$error":"#VALUE!"}]
[18,null,{"$error":"#VALUE!"},{"$f":"E32*'Worksheet 1'!$I$37","v":{"$error":"#VALUE!"}},{"$f":"E31+F29","v":{"$error":"#VALUE!"}},null,0,{"$nulls":46},18,{"$error":"#VALUE!"},{"$error":"#VALUE!"},{"$error":"#VALUE!"},{"$error":"#VALUE!"},null,18,{"$error":"#VALUE!"},{"$error":"#VALUE!"}]
[19,null,{"$error":"#VALUE!"},{"$f":"E33*'Worksheet 1'!$I$37","v":{"$error":"#VALUE!"}},{"$f":"E32+F29","v":{"$error":"#VALUE!"}},null,0,{"$nulls":46},19,{"$error":"#VALUE!"},{"$error":"#VALUE!"},{"$error":"#VALUE!"},{"$error":"#VALUE!"},null,19,{"$error":"#VALUE!"},{"$error":"#VALUE!"}]
[20,null,{"$error":"#VALUE!"},{"$f":"E34*'Worksheet 1'!$I$37","v":{"$error":"#VALUE!"}},{"$f":"IF($B$10=\"N m\",B34/9.806/'Worksheet 1'!$I$37,IF($B$10=\"kg m\",B34/'Worksheet 1'!$I$37,IF($B$10=\"m\",B34,\"error\")))","v":"error"},{"$f":"(E39-E34)/5","v":{"$error":"#VALUE!"}},0,{"$nulls":46},20,"error","X",{"$error":"#VALUE!"},{"$error":"#VALUE!"},null,20,"error","X"]
[21,null,{"$error":"#VALUE!"},{"$f":"E35*'Worksheet 1'!$I$37","v":{"$error":"#VALUE!"}},{"$f":"E34+F34","v":{"$error":"#VALUE!"}},null,0,{"$nulls":46},21,{"$error":"#VALUE!"},{"$error":"#VALUE!"},{"$error":"#VALUE!"},{"$error":"#VALUE!"},null,21,{"$error":"#VALUE!"},{"$error":"#VALUE!"}]
[22,null,{"$error":"#VALUE!"},{"$f":"E36*'Worksheet 1'!$I$37","v":{"$error":"#VALUE!"}},{"$f":"E35+F34","v":{"$error":"#VALUE!"}},null,0,{"$nulls":46},22,{"$error":"#VALUE!"},{"$error":"#VALUE!"},{"$error":"#VALUE!"},{"$error":"#VALUE!"},null,22,{"$error":"#VALUE!"},{"$error":"#VALUE!"}]
[23,null,{"$error":"#VALUE!"},{"$f":"E37*'Worksheet 1'!$I$37","v":{"$error":"#VALUE!"}},{"$f":"E36+F34","v":{"$error":"#VALUE!"}},null,0,{"$nulls":46},23,{"$error":"#VALUE!"},{"$error":"#VALUE!"},{"$error":"#VALUE!"},{"$error":"#VALUE!"},null,23,{"$error":"#VALUE!"},{"$error":"#VALUE!"}]
[24,null,{"$error":"#VALUE!"},{"$f":"E38*'Worksheet 1'!$I$37","v":{"$error":"#VALUE!"}},{"$f":"E37+F34","v":{"$error":"#VALUE!"}},null,0,{"$nulls":46},24,{"$error":"#VALUE!"},{"$error":"#VALUE!"},{"$error":"#VALUE!"},{"$error":"#VALUE!"},null,24,{"$error":"#VALUE!"},{"$error":"#VALUE!"}]
[25,null,{"$error":"#VALUE!"},{"$f":"E39*'Worksheet 1'!$I$37","v":{"$error":"#VALUE!"}},{"$f":"IF($B$10=\"N m\",B39/9.806/'Worksheet 1'!$I$37,IF($B$10=\"kg m\",B39/'Worksheet 1'!$I$37,IF($B$10=\"m\",B39,\"error\")))","v":"error"},{"$f":"(E44-E39)/5","v":{"$error":"#VALUE!"}},0,{"$nulls":46},25,"error","X",{"$error":"#VALUE!"},{"$error":"#VALUE!"},null,25,"error","X"]
[26,null,{"$error":"#VALUE!"},{"$f":"E40*'Worksheet 1'!$I$37","v":{"$error":"#VALUE!"}},{"$f":"E39+F39","v":{"$error":"#VALUE!"}},null,0,{"$nulls":46},26,{"$error":"#VALUE!"},{"$error":"#VALUE!"},{"$error":"#VALUE!"},{"$error":"#VALUE!"},null,26,{"$error":"#VALUE!"},{"$error":"#VALUE!"}]
[27,null,{"$error":"#VALUE!"},{"$f":"E41*'Worksheet 1'!$I$37","v":{"$error":"#VALUE!"}},{"$f":"E40+F39","v":{"$error":"#VALUE!"}},null,0,{"$nulls":46},27,{"$error":"#VALUE!"},{"$error":"#VALUE!"},{"$error":"#VALUE!"},{"$error":"#VALUE!"},null,27,{"$error":"#VALUE!"},{"$error":"#VALUE!"}]
[28,null,{"$error":"#VALUE!"},{"$f":"E42*'Worksheet 1'!$I$37","v":{"$error":"#VALUE!"}},{"$f":"E41+F39","v":{"$error":"#VALUE!"}},null,0,{"$nulls":46},28,{"$error":"#VALUE!"},{"$error":"#VALUE!"},{"$error":"#VALUE!"},{"$error":"#VALUE!"},null,28,{"$error":"#VALUE!"},{"$error":"#VALUE!"}]
[29,null,{"$error":"#VALUE!"},{"$f":"E43*'Worksheet 1'!$I$37","v":{"$error":"#VALUE!"}},{"$f":"E42+F39","v":{"$error":"#VALUE!"}},null,0,{"$nulls":46},29,{"$error":"#VALUE!"},{"$error":"#VALUE!"},{"$error":"#VALUE!"},{"$error":"#VALUE!"},null,29,{"$error":"#VALUE!"},{"$error":"#VALUE!"}]
[30,null,{"$error":"#VALUE!"},{"$f":"E44*'Worksheet 1'!$I$37","v":{"$error":"#VALUE!"}},{"$f":"IF($B$10=\"N m\",B44/9.806/'Worksheet 1'!$I$37,IF($B$10=\"kg m\",B44/'Worksheet 1'!$I$37,IF($B$10=\"m\",B44,\"error\")))","v":"error"},{"$f":"(E49-E44)/5","v":{"$error":"#VALUE!"}},0,{"$nulls":46},30,"error","X",{"$error":"#VALUE!"},{"$error":"#VALUE!"},null,30,"error","X"]
[31,null,{"$error":"#VALUE!"},{"$f":"E45*'Worksheet 1'!$I$37","v":{"$error":"#VALUE!"}},{"$f":"E44+F44","v":{"$error":"#VALUE!"}},null,0,{"$nulls":46},31,{"$error":"#VALUE!"},{"$error":"#VALUE!"},{"$error":"#VALUE!"},{"$error":"#VALUE!"},null,31,{"$error":"#VALUE!"},{"$error":"#VALUE!"}]
[32,null,{"$error":"#VALUE!"},{"$f":"E46*'Worksheet 1'!$I$37","v":{"$error":"#VALUE!"}},{"$f":"E45+F44","v":{"$error":"#VALUE!"}},null,0,{"$nulls":46},32,{"$error":"#VALUE!"},{"$error":"#VALUE!"},{"$error":"#VALUE!"},{"$error":"#VALUE!"},null,32,{"$error":"#VALUE!"},{"$error":"#VALUE!"}]
[33,null,{"$error":"#VALUE!"},{"$f":"E47*'Worksheet 1'!$I$37","v":{"$error":"#VALUE!"}},{"$f":"E46+F44","v":{"$error":"#VALUE!"}},null,0,{"$nulls":46},33,{"$error":"#VALUE!"},{"$error":"#VALUE!"},{"$error":"#VALUE!"},{"$error":"#VALUE!"},null,33,{"$error":"#VALUE!"},{"$error":"#VALUE!"}]
[34,null,{"$error":"#VALUE!"},{"$f":"E48*'Worksheet 1'!$I$37","v":{"$error":"#VALUE!"}},{"$f":"E47+F44","v":{"$error":"#VALUE!"}},null,0,{"$nulls":46},34,{"$error":"#VALUE!"},{"$error":"#VALUE!"},{"$error":"#VALUE!"},{"$error":"#VALUE!"},null,34,{"$error":"#VALUE!"},{"$error":"#VALUE!"}]
[35,null,{"$error":"#VALUE!"},{"$f":"E49*'Worksheet 1'!$I$37","v":{"$error":"#VALUE!"}},{"$f":"IF($B$10=\"N m\",B49/9.806/'Worksheet 1'!$I$37,IF($B$10=\"kg m\",B49/'Worksheet 1'!$I$37,IF($B$10=\"m\",B49,\"error\")))","v":"error"},{"$f":"(E54-E49)/5","v":{"$error":"#VALUE!"}},0,{"$nulls":46},35,"error","X",{"$error":"#VALUE!"},{"$error":"#VALUE!"},null,35,"error","X"]
[36,null,{"$error":"#VALUE!"},{"$f":"E50*'Worksheet 1'!$I$37","v":{"$error":"#VALUE!"}},{"$f":"E49+F49","v":{"$error":"#VALUE!"}},null,0,{"$nulls":46},36,{"$error":"#VALUE!"},{"$error":"#VALUE!"},{"$error":"#VALUE!"},{"$error":"#VALUE!"},null,36,{"$error":"#VALUE!"},{"$error":"#VALUE!"}]
[37,null,{"$error":"#VALUE!"},{"$f":"E51*'Worksheet 1'!$I$37","v":{"$error":"#VALUE!"}},{"$f":"E50+F49","v":{"$error":"#VALUE!"}},null,0,{"$nulls":46},37,{"$error":"#VALUE!"},{"$error":"#VALUE!"},{"$error":"#VALUE!"},{"$error":"#VALUE!"},null,37,{"$error":"#VALUE!"},{"$error":"#VALUE!"}]
[38,null,{"$error":"#VALUE!"},{"$f":"E52*'Worksheet 1'!$I$37","v":{"$error":"#VALUE!"}},{"$f":"E51+F49","v":{"$error":"#VALUE!"}},null,0,{"$nulls":46},38,{"$error":"#VALUE!"},{"$error":"#VALUE!"},{"$error":"#VALUE!"},{"$error":"#VALUE!"},null,38,{"$error":"#VALUE!"},{"$error":"#VALUE!"}]
[39,null,{"$error":"#VALUE!"},{"$f":"E53*'Worksheet 1'!$I$37","v":{"$error":"#VALUE!"}},{"$f":"E52+F49","v":{"$error":"#VALUE!"}},null,0,{"$nulls":46},39,{"$error":"#VALUE!"},{"$error":"#VALUE!"},{"$error":"#VALUE!"},{"$error":"#VALUE!"},null,39,{"$error":"#VALUE!"},{"$error":"#VALUE!"}]
[40,null,{"$f":"D54*9.806","v":{"$error":"#VALUE!"}},{"$f":"E54*'Worksheet 1'!$I$37","v":{"$error":"#VALUE!"}},{"$f":"IF($B$10=\"N m\",B54/9.806/'Worksheet 1'!$I$37,IF($B$10=\"kg m\",B54/'Worksheet 1'!$I$37,IF($B$10=\"m\",B54,\"error\")))","v":"error"},{"$f":"(E59-E54)/5","v":{"$error":"#VALUE!"}},0,{"$nulls":46},40,{"$f":"E54","v":"error"},"X",{"$error":"#VALUE!"},{"$error":"#VALUE!"},null,40,"error","X"]
[41,null,{"$error":"#VALUE!"},{"$f":"E55*'Worksheet 1'!$I$37","v":{"$error":"#VALUE!"}},{"$f":"E54+F54","v":{"$error":"#VALUE!"}},null,0,{"$nulls":46},41,{"$error":"#VALUE!"},{"$error":"#VALUE!"},{"$error":"#VALUE!"},{"$error":"#VALUE!"},null,41,{"$error":"#VALUE!"},{"$error":"#VALUE!"}]
[42,null,{"$error":"#VALUE!"},{"$f":"E56*'Worksheet 1'!$I$37","v":{"$error":"#VALUE!"}},{"$f":"E55+F54","v":{"$error":"#VALUE!"}},null,0,{"$nulls":46},42,{"$error":"#VALUE!"},{"$error":"#VALUE!"},{"$error":"#VALUE!"},{"$error":"#VALUE!"},null,42,{"$error":"#VALUE!"},{"$error":"#VALUE!"}]
[43,null,{"$error":"#VALUE!"},{"$f":"E57*'Worksheet 1'!$I$37","v":{"$error":"#VALUE!"}},{"$f":"E56+F54","v":{"$error":"#VALUE!"}},null,0,{"$nulls":46},43,{"$error":"#VALUE!"},{"$error":"#VALUE!"},{"$error":"#VALUE!"},{"$error":"#VALUE!"},null,43,{"$error":"#VALUE!"},{"$error":"#VALUE!"}]
[44,null,{"$error":"#VALUE!"},{"$f":"E58*'Worksheet 1'!$I$37","v":{"$error":"#VALUE!"}},{"$f":"E57+F54","v":{"$error":"#VALUE!"}},null,0,{"$nulls":46},44,{"$error":"#VALUE!"},{"$error":"#VALUE!"},{"$error":"#VALUE!"},{"$error":"#VALUE!"},null,44,{"$error":"#VALUE!"},{"$error":"#VALUE!"}]
[45,null,{"$error":"#VALUE!"},{"$f":"E59*'Worksheet 1'!$I$37","v":{"$error":"#VALUE!"}},{"$f":"IF($B$10=\"N m\",B59/9.806/'Worksheet 1'!$I$37,IF($B$10=\"kg m\",B59/'Worksheet 1'!$I$37,IF($B$10=\"m\",B59,\"error\")))","v":"error"},{"$f":"(E64-E59)/5","v":{"$error":"#VALUE!"}},0,{"$nulls":46},45,"error","X",{"$error":"#VALUE!"},{"$error":"#VALUE!"},null,45,"error","X"]
[46,null,{"$error":"#VALUE!"},{"$f":"E60*'Worksheet 1'!$I$37","v":{"$error":"#VALUE!"}},{"$f":"E59+F59","v":{"$error":"#VALUE!"}},null,0,{"$nulls":46},46,{"$error":"#VALUE!"},{"$error":"#VALUE!"},{"$error":"#VALUE!"},{"$error":"#VALUE!"},null,46,{"$error":"#VALUE!"},{"$error":"#VALUE!"}]
[47,null,{"$error":"#VALUE!"},{"$f":"E61*'Worksheet 1'!$I$37","v":{"$error":"#VALUE!"}},{"$f":"E60+F59","v":{"$error":"#VALUE!"}},null,0,{"$nulls":46},47,{"$error":"#VALUE!"},{"$error":"#VALUE!"},{"$error":"#VALUE!"},{"$error":"#VALUE!"},null,47,{"$error":"#VALUE!"},{"$error":"#VALUE!"}]
[48,null,{"$error":"#VALUE!"},{"$f":"E62*'Worksheet 1'!$I$37","v":{"$error":"#VALUE!"}},{"$f":"E61+F59","v":{"$error":"#VALUE!"}},null,0,{"$nulls":46},48,{"$error":"#VALUE!"},{"$error":"#VALUE!"},{"$error":"#VALUE!"},{"$error":"#VALUE!"},null,48,{"$error":"#VALUE!"},{"$error":"#VALUE!"}]
[49,null,{"$error":"#VALUE!"},{"$f":"E63*'Worksheet 1'!$I$37","v":{"$error":"#VALUE!"}},{"$f":"E62+F59","v":{"$error":"#VALUE!"}},null,0,{"$nulls":46},49,{"$error":"#VALUE!"},{"$error":"#VALUE!"},{"$error":"#VALUE!"},{"$error":"#VALUE!"},null,49,{"$error":"#VALUE!"},{"$error":"#VALUE!"}]
[50,null,{"$error":"#VALUE!"},{"$f":"E64*'Worksheet 1'!$I$37","v":{"$error":"#VALUE!"}},{"$f":"IF($B$10=\"N m\",B64/9.806/'Worksheet 1'!$I$37,IF($B$10=\"kg m\",B64/'Worksheet 1'!$I$37,IF($B$10=\"m\",B64,\"error\")))","v":"error"},{"$f":"(E69-E64)/5","v":{"$error":"#VALUE!"}},0,{"$nulls":46},50,"error","X",{"$error":"#VALUE!"},{"$error":"#VALUE!"},null,50,"error","X"]
[51,null,{"$error":"#VALUE!"},{"$f":"E65*'Worksheet 1'!$I$37","v":{"$error":"#VALUE!"}},{"$f":"E64+F64","v":{"$error":"#VALUE!"}},null,0,{"$nulls":46},51,{"$error":"#VALUE!"},{"$error":"#VALUE!"},{"$error":"#VALUE!"},{"$error":"#VALUE!"},null,51,{"$error":"#VALUE!"},{"$error":"#VALUE!"}]
[52,null,{"$error":"#VALUE!"},{"$f":"E66*'Worksheet 1'!$I$37","v":{"$error":"#VALUE!"}},{"$f":"E65+F64","v":{"$error":"#VALUE!"}},null,0,{"$nulls":46},52,{"$error":"#VALUE!"},{"$error":"#VALUE!"},{"$error":"#VALUE!"},{"$error":"#VALUE!"},null,52,{"$error":"#VALUE!"},{"$error":"#VALUE!"}]
[53,null,{"$error":"#VALUE!"},{"$f":"E67*'Worksheet 1'!$I$37","v":{"$error":"#VALUE!"}},{"$f":"E66+F64","v":{"$error":"#VALUE!"}},null,0,{"$nulls":46},53,{"$error":"#VALUE!"},{"$error":"#VALUE!"},{"$error":"#VALUE!"},{"$error":"#VALUE!"},null,53,{"$error":"#VALUE!"},{"$error":"#VALUE!"}]
[54,null,{"$error":"#VALUE!"},{"$f":"E68*'Worksheet 1'!$I$37","v":{"$error":"#VALUE!"}},{"$f":"E67+F64","v":{"$error":"#VALUE!"}},null,0,{"$nulls":46},54,{"$error":"#VALUE!"},{"$error":"#VALUE!"},{"$error":"#VALUE!"},{"$error":"#VALUE!"},null,54,{"$error":"#VALUE!"},{"$error":"#VALUE!"}]
[55,null,{"$error":"#VALUE!"},{"$f":"E69*'Worksheet 1'!$I$37","v":{"$error":"#VALUE!"}},{"$f":"IF($B$10=\"N m\",B69/9.806/'Worksheet 1'!$I$37,IF($B$10=\"kg m\",B69/'Worksheet 1'!$I$37,IF($B$10=\"m\",B69,\"error\")))","v":"error"},{"$f":"(E74-E69)/5","v":{"$error":"#VALUE!"}},0,{"$nulls":46},55,"error","X",{"$error":"#VALUE!"},{"$error":"#VALUE!"},null,55,"error","X"]
[56,null,{"$error":"#VALUE!"},{"$f":"E70*'Worksheet 1'!$I$37","v":{"$error":"#VALUE!"}},{"$f":"E69+F69","v":{"$error":"#VALUE!"}},null,0,{"$nulls":46},56,{"$error":"#VALUE!"},{"$error":"#VALUE!"},{"$error":"#VALUE!"},{"$error":"#VALUE!"},null,56,{"$error":"#VALUE!"},{"$error":"#VALUE!"}]
[57,null,{"$error":"#VALUE!"},{"$f":"E71*'Worksheet 1'!$I$37","v":{"$error":"#VALUE!"}},{"$f":"E70+F69","v":{"$error":"#VALUE!"}},null,0,{"$nulls":46},57,{"$error":"#VALUE!"},{"$error":"#VALUE!"},{"$error":"#VALUE!"},{"$error":"#VALUE!"},null,57,{"$error":"#VALUE!"},{"$error":"#VALUE!"}]
[58,null,{"$error":"#VALUE!"},{"$f":"E72*'Worksheet 1'!$I$37","v":{"$error":"#VALUE!"}},{"$f":"E71+F69","v":{"$error":"#VALUE!"}},null,0,{"$nulls":46},58,{"$error":"#VALUE!"},{"$error":"#VALUE!"},{"$error":"#VALUE!"},{"$error":"#VALUE!"},null,58,{"$error":"#VALUE!"},{"$error":"#VALUE!"}]
[59,null,{"$error":"#VALUE!"},{"$f":"E73*'Worksheet 1'!$I$37","v":{"$error":"#VALUE!"}},{"$f":"E72+F69","v":{"$error":"#VALUE!"}},null,0,{"$nulls":46},59,{"$error":"#VALUE!"},{"$error":"#VALUE!"},{"$error":"#VALUE!"},{"$error":"#VALUE!"},null,59,{"$error":"#VALUE!"},{"$error":"#VALUE!"}]
[60,null,{"$error":"#VALUE!"},{"$f":"E74*'Worksheet 1'!$I$37","v":{"$error":"#VALUE!"}},{"$f":"IF($B$10=\"N m\",B74/9.806/'Worksheet 1'!$I$37,IF($B$10=\"kg m\",B74/'Worksheet 1'!$I$37,IF($B$10=\"m\",B74,\"error\")))","v":"error"},{"$f":"(E79-E74)/5","v":{"$error":"#VALUE!"}},0,{"$nulls":46},60,"error","X",{"$error":"#VALUE!"},{"$error":"#VALUE!"},null,60,"error","X"]
[61,null,{"$error":"#VALUE!"},{"$f":"E75*'Worksheet 1'!$I$37","v":{"$error":"#VALUE!"}},{"$f":"E74+F74","v":{"$error":"#VALUE!"}},null,0,{"$nulls":46},61,{"$error":"#VALUE!"},{"$error":"#VALUE!"},{"$error":"#VALUE!"},{"$error":"#VALUE!"},null,61,{"$error":"#VALUE!"},{"$error":"#VALUE!"}]
[62,null,{"$error":"#VALUE!"},{"$f":"E76*'Worksheet 1'!$I$37","v":{"$error":"#VALUE!"}},{"$f":"E75+F74","v":{"$error":"#VALUE!"}},null,0,{"$nulls":46},62,{"$error":"#VALUE!"},{"$error":"#VALUE!"},{"$error":"#VALUE!"},{"$error":"#VALUE!"},null,62,{"$error":"#VALUE!"},{"$error":"#VALUE!"}]
[63,null,{"$error":"#VALUE!"},{"$f":"E77*'Worksheet 1'!$I$37","v":{"$error":"#VALUE!"}},{"$f":"E76+F74","v":{"$error":"#VALUE!"}},null,0,{"$nulls":46},63,{"$error":"#VALUE!"},{"$error":"#VALUE!"},{"$error":"#VALUE!"},{"$error":"#VALUE!"},null,63,{"$error":"#VALUE!"},{"$error":"#VALUE!"}]
[64,null,{"$error":"#VALUE!"},{"$f":"E78*'Worksheet 1'!$I$37","v":{"$error":"#VALUE!"}},{"$f":"E77+F74","v":{"$error":"#VALUE!"}},null,0,{"$nulls":46},64,{"$error":"#VALUE!"},{"$f":"IF(BC78>0,\"X\",\"\")","v":{"$error":"#VALUE!"}},{"$f":"IF(AND(BD78=\"X\",BD79=\"\"),BB78,\"\")","v":{"$error":"#VALUE!"}},{"$error":"#VALUE!"},null,64,{"$error":"#VALUE!"},{"$f":"IF(BI78>=0,\"X\",\"\")","v":{"$error":"#VALUE!"}}]
[65,null,{"$error":"#VALUE!"},{"$f":"E79*'Worksheet 1'!$I$37","v":{"$error":"#VALUE!"}},{"$f":"IF($B$10=\"N m\",B79/9.806/'Worksheet 1'!$I$37,IF($B$10=\"kg m\",B79/'Worksheet 1'!$I$37,IF($B$10=\"m\",B79,\"error\")))","v":"error"},{"$f":"(E84-E79)/5","v":{"$error":"#VALUE!"}},0,{"$nulls":46},65,"error","X",{"$error":"#VALUE!"},{"$f":"IF(AND(BB79<=$BC$177,BD79=\"X\"),E79,\"\")","v":{"$error":"#VALUE!"}},null,65,{"$f":"IF(E79>=0,E79,\"\")","v":"error"},"X"]
[66,null,{"$error":"#VALUE!"},{"$f":"E80*'Worksheet 1'!$I$37","v":{"$error":"#VALUE!"}},{"$f":"E79+F79","v":{"$error":"#VALUE!"}},null,0,{"$nulls":46},66,{"$error":"#VALUE!"},{"$error":"#VALUE!"},{"$error":"#VALUE!"},{"$error":"#VALUE!"},null,66,{"$error":"#VALUE!"},{"$error":"#VALUE!"}]
[67,null,{"$error":"#VALUE!"},{"$f":"E81*'Worksheet 1'!$I$37","v":{"$error":"#VALUE!"}},{"$f":"E80+F79","v":{"$error":"#VALUE!"}},null,0,{"$nulls":46},67,{"$error":"#VALUE!"},{"$error":"#VALUE!"},{"$error":"#VALUE!"},{"$error":"#VALUE!"},null,67,{"$error":"#VALUE!"},{"$error":"#VALUE!"}]
[68,null,{"$error":"#VALUE!"},{"$f":"E82*'Worksheet 1'!$I$37","v":{"$error":"#VALUE!"}},{"$f":"E81+F79","v":{"$error":"#VALUE!"}},null,0,{"$nulls":46},68,{"$error":"#VALUE!"},{"$error":"#VALUE!"},{"$error":"#VALUE!"},{"$error":"#VALUE!"},null,68,{"$error":"#VALUE!"},{"$error":"#VALUE!"}]
[69,null,{"$error":"#VALUE!"},{"$f":"E83*'Worksheet 1'!$I$37","v":{"$error":"#VALUE!"}},{"$f":"E82+F79","v":{"$error":"#VALUE!"}},null,0,{"$nulls":46},69,{"$error":"#VALUE!"},{"$error":"#VALUE!"},{"$error":"#VALUE!"},{"$error":"#VALUE!"},null,69,{"$error":"#VALUE!"},{"$error":"#VALUE!"}]
[70,null,{"$error":"#VALUE!"},{"$f":"E84*'Worksheet 1'!$I$37","v":{"$error":"#VALUE!"}},{"$f":"IF($B$10=\"N m\",B84/9.806/'Worksheet 1'!$I$37,IF($B$10=\"kg m\",B84/'Worksheet 1'!$I$37,IF($B$10=\"m\",B84,\"error\")))","v":"error"},{"$f":"(E89-E84)/5","v":{"$error":"#VALUE!"}},0,{"$nulls":46},70,"error","X",{"$error":"#VALUE!"},{"$error":"#VALUE!"},null,70,"error","X"]
[71,null,{"$f":"D85*9.806","v":{"$error":"#VALUE!"}},{"$f":"E85*'Worksheet 1'!$I$37","v":{"$error":"#VALUE!"}},{"$f":"E84+F84","v":{"$error":"#VALUE!"}},null,0,{"$nulls":46},71,{"$f":"E85","v":{"$error":"#VALUE!"}},{"$error":"#VALUE!"},{"$error":"#VALUE!"},{"$error":"#VALUE!"},null,71,{"$error":"#VALUE!"},{"$error":"#VALUE!"}]
[72,null,{"$error":"#VALUE!"},{"$f":"E86*'Worksheet 1'!$I$37","v":{"$error":"#VALUE!"}},{"$f":"E85+F84","v":{"$error":"#VALUE!"}},null,0,{"$nulls":46},72,{"$error":"#VALUE!"},{"$error":"#VALUE!"},{"$error":"#VALUE!"},{"$error":"#VALUE!"},null,72,{"$error":"#VALUE!"},{"$error":"#VALUE!"}]
[73,null,{"$error":"#VALUE!"},{"$f":"E87*'Worksheet 1'!$I$37","v":{"$error":"#VALUE!"}},{"$f":"E86+F84","v":{"$error":"#VALUE!"}},null,0,{"$nulls":46},73,{"$error":"#VALUE!"},{"$error":"#VALUE!"},{"$error":"#VALUE!"},{"$error":"#VALUE!"},null,73,{"$error":"#VALUE!"},{"$error":"#VALUE!"}]
[74,null,{"$error":"#VALUE!"},{"$f":"E88*'Worksheet 1'!$I$37","v":{"$error":"#VALUE!"}},{"$f":"E87+F84","v":{"$error":"#VALUE!"}},null,0,{"$nulls":46},74,{"$error":"#VALUE!"},{"$error":"#VALUE!"},{"$error":"#VALUE!"},{"$error":"#VALUE!"},null,74,{"$error":"#VALUE!"},{"$error":"#VALUE!"}]
[75,null,{"$f":"D89*9.806","v":{"$error":"#VALUE!"}},{"$f":"E89*'Worksheet 1'!$I$37","v":{"$error":"#VALUE!"}},{"$f":"IF($B$10=\"N m\",B89/9.806/'Worksheet 1'!$I$37,IF($B$10=\"kg m\",B89/'Worksheet 1'!$I$37,IF($B$10=\"m\",B89,\"error\")))","v":"error"},{"$f":"(E94-E89)/5","v":{"$error":"#VALUE!"}},0,{"$nulls":46},75,"error","X",{"$error":"#VALUE!"},{"$error":"#VALUE!"},null,75,"error","X"]
[76,null,{"$error":"#VALUE!"},{"$f":"E90*'Worksheet 1'!$I$37","v":{"$error":"#VALUE!"}},{"$f":"E89+F89","v":{"$error":"#VALUE!"}},null,0,{"$nulls":46},76,{"$error":"#VALUE!"},{"$error":"#VALUE!"},{"$error":"#VALUE!"},{"$error":"#VALUE!"},null,76,{"$error":"#VALUE!"},{"$error":"#VALUE!"}]
[77,null,{"$error":"#VALUE!"},{"$f":"E91*'Worksheet 1'!$I$37","v":{"$error":"#VALUE!"}},{"$f":"E90+F89","v":{"$error":"#VALUE!"}},null,0,{"$nulls":46},77,{"$error":"#VALUE!"},{"$error":"#VALUE!"},{"$error":"#VALUE!"},{"$error":"#VALUE!"},null,77,{"$error":"#VALUE!"},{"$error":"#VALUE!"}]
[78,null,{"$error":"#VALUE!"},{"$f":"E92*'Worksheet 1'!$I$37","v":{"$error":"#VALUE!"}},{"$f":"E91+F89","v":{"$error":"#VALUE!"}},null,0,{"$nulls":46},78,{"$error":"#VALUE!"},{"$error":"#VALUE!"},{"$error":"#VALUE!"},{"$error":"#VALUE!"},null,78,{"$error":"#VALUE!"},{"$error":"#VALUE!"}]
[79,null,{"$error":"#VALUE!"},{"$f":"E93*'Worksheet 1'!$I$37","v":{"$error":"#VALUE!"}},{"$f":"E92+F89","v":{"$error":"#VALUE!"}},null,0,{"$nulls":46},79,{"$error":"#VALUE!"},{"$error":"#VALUE!"},{"$error":"#VALUE!"},{"$error":"#VALUE!"},null,79,{"$error":"#VALUE!"},{"$error":"#VALUE!"}]
[80,null,{"$error":"#VALUE!"},{"$f":"E94*'Worksheet 1'!$I$37","v":{"$error":"#VALUE!"}},{"$f":"IF($B$10=\"N m\",B94/9.806/'Worksheet 1'!$I$37,IF($B$10=\"kg m\",B94/'Worksheet 1'!$I$37,IF($B$10=\"m\",B94,\"error\")))","v":"error"},{"$f":"(E99-E94)/5","v":{"$error":"#VALUE!"}},0,{"$nulls":46},80,"error","X",{"$error":"#VALUE!"},{"$error":"#VALUE!"},null,80,"error","X"]
[81,null,{"$error":"#VALUE!"},{"$f":"E95*'Worksheet 1'!$I$37","v":{"$error":"#VALUE!"}},{"$f":"E94+F94","v":{"$error":"#VALUE!"}},null,0,{"$nulls":46},81,{"$error":"#VALUE!"},{"$error":"#VALUE!"},{"$error":"#VALUE!"},{"$error":"#VALUE!"},null,81,{"$error":"#VALUE!"},{"$error":"#VALUE!"}]
[82,null,{"$error":"#VALUE!"},{"$f":"E96*'Worksheet 1'!$I$37","v":{"$error":"#VALUE!"}},{"$f":"E95+F94","v":{"$error":"#VALUE!"}},null,0,{"$nulls":46},82,{"$error":"#VALUE!"},{"$error":"#VALUE!"},{"$error":"#VALUE!"},{"$error":"#VALUE!"},null,82,{"$error":"#VALUE!"},{"$error":"#VALUE!"}]
[83,null,{"$error":"#VALUE!"},{"$f":"E97*'Worksheet 1'!$I$37","v":{"$error":"#VALUE!"}},{"$f":"E96+F94","v":{"$error":"#VALUE!"}},null,0,{"$nulls":46},83,{"$error":"#VALUE!"},{"$error":"#VALUE!"},{"$error":"#VALUE!"},{"$error":"#VALUE!"},null,83,{"$error":"#VALUE!"},{"$error":"#VALUE!"}]
[84,null,{"$error":"#VALUE!"},{"$f":"E98*'Worksheet 1'!$I$37","v":{"$error":"#VALUE!"}},{"$f":"E97+F94","v":{"$error":"#VALUE!"}},null,0,{"$nulls":46},84,{"$error":"#VALUE!"},{"$error":"#VALUE!"},{"$error":"#VALUE!"},{"$error":"#VALUE!"},null,84,{"$error":"#VALUE!"},{"$error":"#VALUE!"}]
[85,null,{"$f":"D99*9.806","v":{"$error":"#VALUE!"}},{"$f":"E99*'Worksheet 1'!$I$37","v":{"$error":"#VALUE!"}},{"$f":"IF($B$10=\"N m\",B99/9.806/'Worksheet 1'!$I$37,IF($B$10=\"kg m\",B99/'Worksheet 1'!$I$37,IF($B$10=\"m\",B99,\"error\")))","v":"error"},{"$f":"(E104-E99)/5","v":{"$error":"#VALUE!"}},0,{"$nulls":46},85,"error","X",{"$error":"#VALUE!"},{"$error":"#VALUE!"},null,85,"error","X"]
[86,null,{"$error":"#VALUE!"},{"$f":"E100*'Worksheet 1'!$I$37","v":{"$error":"#VALUE!"}},{"$f":"E99+F99","v":{"$error":"#VALUE!"}},null,0,{"$nulls":46},86,{"$error":"#VALUE!"},{"$error":"#VALUE!"},{"$error":"#VALUE!"},{"$error":"#VALUE!"},null,86,{"$error":"#VALUE!"},{"$error":"#VALUE!"}]
[87,null,{"$error":"#VALUE!"},{"$f":"E101*'Worksheet 1'!$I$37","v":{"$error":"#VALUE!"}},{"$f":"E100+F99","v":{"$error":"#VALUE!"}},null,0,{"$nulls":46},87,{"$error":"#VALUE!"},{"$error":"#VALUE!"},{"$error":"#VALUE!"},{"$error":"#VALUE!"},null,87,{"$error":"#VALUE!"},{"$error":"#VALUE!"}]
[88,null,{"$error":"#VALUE!"},{"$f":"E102*'Worksheet 1'!$I$37","v":{"$error":"#VALUE!"}},{"$f":"E101+F99","v":{"$error":"#VALUE!"}},null,0,{"$nulls":46},88,{"$error":"#VALUE!"},{"$error":"#VALUE!"},{"$error":"#VALUE!"},{"$error":"#VALUE!"},null,88,{"$error":"#VALUE!"},{"$error":"#VALUE!"}]
[89,null,{"$error":"#VALUE!"},{"$f":"E103*'Worksheet 1'!$I$37","v":{"$error":"#VALUE!"}},{"$f":"E102+F99","v":{"$error":"#VALUE!"}},null,0,{"$nulls":46},89,{"$error":"#VALUE!"},{"$error":"#VALUE!"},{"$error":"#VALUE!"},{"$error":"#VALUE!"},null,89,{"$error":"#VALUE!"},{"$error":"#VALUE!"}]
[90,null,{"$error":"#VALUE!"},{"$f":"E104*'Worksheet 1'!$I$37","v":{"$error":"#VALUE!"}},{"$f":"IF($B$10=\"N m\",B104/9.806/'Worksheet 1'!$I$37,IF($B$10=\"kg m\",B104/'Worksheet 1'!$I$37,IF($B$10=\"m\",B104,\"error\")))","v":"error"},{"$f":"(E109-E104)/5","v":{"$error":"#VALUE!"}},0,{"$nulls":46},90,"error","X",{"$error":"#VALUE!"},{"$error":"#VALUE!"},null,90,"error","X"]
[91,null,{"$error":"#VALUE!"},{"$f":"E105*'Worksheet 1'!$I$37","v":{"$error":"#VALUE!"}},{"$f":"E104+F104","v":{"$error":"#VALUE!"}},null,0,{"$nulls":46},91,{"$error":"#VALUE!"},{"$error":"#VALUE!"},{"$error":"#VALUE!"},{"$error":"#VALUE!"},null,91,{"$error":"#VALUE!"},{"$error":"#VALUE!"}]
[92,null,{"$error":"#VALUE!"},{"$f":"E106*'Worksheet 1'!$I$37","v":{"$error":"#VALUE!"}},{"$f":"E105+F104","v":{"$error":"#VALUE!"}},null,0,{"$nulls":46},92,{"$error":"#VALUE!"},{"$error":"#VALUE!"},{"$error":"#VALUE!"},{"$error":"#VALUE!"},null,92,{"$error":"#VALUE!"},{"$error":"#VALUE!"}]
[93,null,{"$error":"#VALUE!"},{"$f":"E107*'Worksheet 1'!$I$37","v":{"$error":"#VALUE!"}},{"$f":"E106+F104","v":{"$error":"#VALUE!"}},null,0,{"$nulls":46},93,{"$error":"#VALUE!"},{"$error":"#VALUE!"},{"$error":"#VALUE!"},{"$error":"#VALUE!"},null,93,{"$error":"#VALUE!"},{"$error":"#VALUE!"}]
[94,null,{"$error":"#VALUE!"},{"$f":"E108*'Worksheet 1'!$I$37","v":{"$error":"#VALUE!"}},{"$f":"E107+F104","v":{"$error":"#VALUE!"}},null,0,{"$nulls":46},94,{"$error":"#VALUE!"},{"$error":"#VALUE!"},{"$error":"#VALUE!"},{"$error":"#VALUE!"},null,94,{"$error":"#VALUE!"},{"$error":"#VALUE!"}]
[95,null,{"$error":"#VALUE!"},{"$f":"E109*'Worksheet 1'!$I$37","v":{"$error":"#VALUE!"}},{"$f":"IF($B$10=\"N m\",B109/9.806/'Worksheet 1'!$I$37,IF($B$10=\"kg m\",B109/'Worksheet 1'!$I$37,IF($B$10=\"m\",B109,\"error\")))","v":"error"},{"$f":"(E114-E109)/5","v":{"$error":"#VALUE!"}},0,{"$nulls":46},95,"error","X",{"$error":"#VALUE!"},{"$error":"#VALUE!"},null,95,"error","X"]
[96,null,{"$error":"#VALUE!"},{"$f":"E110*'Worksheet 1'!$I$37","v":{"$error":"#VALUE!"}},{"$f":"E109+F109","v":{"$error":"#VALUE!"}},null,0,{"$nulls":46},96,{"$error":"#VALUE!"},{"$error":"#VALUE!"},{"$error":"#VALUE!"},{"$error":"#VALUE!"},null,96,{"$error":"#VALUE!"},{"$error":"#VALUE!"}]
[97,null,{"$error":"#VALUE!"},{"$f":"E111*'Worksheet 1'!$I$37","v":{"$error":"#VALUE!"}},{"$f":"E110+F109","v":{"$error":"#VALUE!"}},null,0,{"$nulls":46},97,{"$error":"#VALUE!"},{"$error":"#VALUE!"},{"$error":"#VALUE!"},{"$error":"#VALUE!"},null,97,{"$error":"#VALUE!"},{"$error":"#VALUE!"}]
[98,null,{"$error":"#VALUE!"},{"$f":"E112*'Worksheet 1'!$I$37","v":{"$error":"#VALUE!"}},{"$f":"E111+F109","v":{"$error":"#VALUE!"}},null,0,{"$nulls":46},98,{"$error":"#VALUE!"},{"$error":"#VALUE!"},{"$error":"#VALUE!"},{"$error":"#VALUE!"},null,98,{"$error":"#VALUE!"},{"$error":"#VALUE!"}]
[99,null,{"$error":"#VALUE!"},{"$f":"E113*'Worksheet 1'!$I$37","v":{"$error":"#VALUE!"}},{"$f":"E112+F109","v":{"$error":"#VALUE!"}},null,0,{"$nulls":46},99,{"$error":"#VALUE!"},{"$error":"#VALUE!"},{"$error":"#VALUE!"},{"$error":"#VALUE!"},null,99,{"$error":"#VALUE!"},{"$error":"#VALUE!"}]
[100,null,{"$error":"#VALUE!"},{"$f":"E114*'Worksheet 1'!$I$37","v":{"$error":"#VALUE!"}},{"$f":"IF($B$10=\"N m\",B114/9.806/'Worksheet 1'!$I$37,IF($B$10=\"kg m\",B114/'Worksheet 1'!$I$37,IF($B$10=\"m\",B114,\"error\")))","v":"error"},{"$f":"(E119-E114)/5","v":{"$error":"#VALUE!"}},0,{"$nulls":46},100,"error","X",{"$error":"#VALUE!"},{"$error":"#VALUE!"},null,100,"error","X"]
[101,null,{"$error":"#VALUE!"},{"$f":"E115*'Worksheet 1'!$I$37","v":{"$error":"#VALUE!"}},{"$f":"E114+F114","v":{"$error":"#VALUE!"}},null,0,{"$nulls":46},101,{"$error":"#VALUE!"},{"$error":"#VALUE!"},{"$error":"#VALUE!"},{"$error":"#VALUE!"},null,101,{"$error":"#VALUE!"},{"$error":"#VALUE!"}]
[102,null,{"$error":"#VALUE!"},{"$f":"E116*'Worksheet 1'!$I$37","v":{"$error":"#VALUE!"}},{"$f":"E115+F114","v":{"$error":"#VALUE!"}},null,0,{"$nulls":46},102,{"$error":"#VALUE!"},{"$error":"#VALUE!"},{"$error":"#VALUE!"},{"$error":"#VALUE!"},null,102,{"$error":"#VALUE!"},{"$error":"#VALUE!"}]
[103,null,{"$error":"#VALUE!"},{"$f":"E117*'Worksheet 1'!$I$37","v":{"$error":"#VALUE!"}},{"$f":"E116+F114","v":{"$error":"#VALUE!"}},null,0,{"$nulls":46},103,{"$error":"#VALUE!"},{"$error":"#VALUE!"},{"$error":"#VALUE!"},{"$error":"#VALUE!"},null,103,{"$error":"#VALUE!"},{"$error":"#VALUE!"}]
[104,null,{"$error":"#VALUE!"},{"$f":"E118*'Worksheet 1'!$I$37","v":{"$error":"#VALUE!"}},{"$f":"E117+F114","v":{"$error":"#VALUE!"}},null,0,{"$nulls":46},104,{"$error":"#VALUE!"},{"$error":"#VALUE!"},{"$error":"#VALUE!"},{"$error":"#VALUE!"},null,104,{"$error":"#VALUE!"},{"$error":"#VALUE!"}]
[105,null,{"$f":"D119*9.806","v":{"$error":"#VALUE!"}},{"$f":"E119*'Worksheet 1'!$I$37","v":{"$error":"#VALUE!"}},{"$f":"IF($B$10=\"N m\",B119/9.806/'Worksheet 1'!$I$37,IF($B$10=\"kg m\",B119/'Worksheet 1'!$I$37,IF($B$10=\"m\",B119,\"error\")))","v":"error"},{"$f":"(E124-E119)/5","v":{"$error":"#VALUE!"}},0,{"$nulls":46},105,"error","X",{"$error":"#VALUE!"},{"$error":"#VALUE!"},null,105,"error","X"]
[106,null,{"$error":"#VALUE!"},{"$f":"E120*'Worksheet 1'!$I$37","v":{"$error":"#VALUE!"}},{"$f":"E119+F119","v":{"$error":"#VALUE!"}},null,0,{"$nulls":46},106,{"$error":"#VALUE!"},{"$error":"#VALUE!"},{"$error":"#VALUE!"},{"$error":"#VALUE!"},null,106,{"$error":"#VALUE!"},{"$error":"#VALUE!"}]
[107,null,{"$error":"#VALUE!"},{"$f":"E121*'Worksheet 1'!$I$37","v":{"$error":"#VALUE!"}},{"$f":"E120+F119","v":{"$error":"#VALUE!"}},null,0,{"$nulls":46},107,{"$error":"#VALUE!"},{"$error":"#VALUE!"},{"$error":"#VALUE!"},{"$error":"#VALUE!"},null,107,{"$error":"#VALUE!"},{"$error":"#VALUE!"}]
[108,null,{"$error":"#VALUE!"},{"$f":"E122*'Worksheet 1'!$I$37","v":{"$error":"#VALUE!"}},{"$f":"E121+F119","v":{"$error":"#VALUE!"}},null,0,{"$nulls":46},108,{"$error":"#VALUE!"},{"$error":"#VALUE!"},{"$error":"#VALUE!"},{"$error":"#VALUE!"},null,108,{"$error":"#VALUE!"},{"$error":"#VALUE!"}]
[109,null,{"$error":"#VALUE!"},{"$f":"E123*'Worksheet 1'!$I$37","v":{"$error":"#VALUE!"}},{"$f":"E122+F119","v":{"$error":"#VALUE!"}},null,0,{"$nulls":46},109,{"$error":"#VALUE!"},{"$error":"#VALUE!"},{"$error":"#VALUE!"},{"$error":"#VALUE!"},null,109,{"$error":"#VALUE!"},{"$error":"#VALUE!"}]
[110,null,{"$f":"D124*9.806","v":{"$error":"#VALUE!"}},{"$f":"E124*'Worksheet 1'!$I$37","v":{"$error":"#VALUE!"}},{"$f":"IF($B$10=\"N m\",B124/9.806/'Worksheet 1'!$I$37,IF($B$10=\"kg m\",B124/'Worksheet 1'!$I$37,IF($B$10=\"m\",B124,\"error\")))","v":"error"},{"$f":"(E129-E124)/5","v":{"$error":"#VALUE!"}},0,{"$nulls":46},110,"error","X",{"$error":"#VALUE!"},{"$error":"#VALUE!"},null,110,"error","X"]
[111,null,{"$error":"#VALUE!"},{"$f":"E125*'Worksheet 1'!$I$37","v":{"$error":"#VALUE!"}},{"$f":"E124+F124","v":{"$error":"#VALUE!"}},null,0,{"$nulls":46},111,{"$error":"#VALUE!"},{"$error":"#VALUE!"},{"$error":"#VALUE!"},{"$error":"#VALUE!"},null,111,{"$error":"#VALUE!"},{"$error":"#VALUE!"}]
[112,null,{"$error":"#VALUE!"},{"$f":"E126*'Worksheet 1'!$I$37","v":{"$error":"#VALUE!"}},{"$f":"E125+F124","v":{"$error":"#VALUE!"}},null,0,{"$nulls":46},112,{"$error":"#VALUE!"},{"$error":"#VALUE!"},{"$error":"#VALUE!"},{"$error":"#VALUE!"},null,112,{"$error":"#VALUE!"},{"$error":"#VALUE!"}]
[113,null,{"$error":"#VALUE!"},{"$f":"E127*'Worksheet 1'!$I$37","v":{"$error":"#VALUE!"}},{"$f":"E126+F124","v":{"$error":"#VALUE!"}},null,0,{"$nulls":46},113,{"$error":"#VALUE!"},{"$error":"#VALUE!"},{"$error":"#VALUE!"},{"$error":"#VALUE!"},null,113,{"$error":"#VALUE!"},{"$error":"#VALUE!"}]
[114,null,{"$error":"#VALUE!"},{"$f":"E128*'Worksheet 1'!$I$37","v":{"$error":"#VALUE!"}},{"$f":"E127+F124","v":{"$error":"#VALUE!"}},null,0,{"$nulls":46},114,{"$error":"#VALUE!"},{"$error":"#VALUE!"},{"$error":"#VALUE!"},{"$error":"#VALUE!"},null,114,{"$error":"#VALUE!"},{"$error":"#VALUE!"}]
[115,null,{"$error":"#VALUE!"},{"$f":"E129*'Worksheet 1'!$I$37","v":{"$error":"#VALUE!"}},{"$f":"IF($B$10=\"N m\",B129/9.806/'Worksheet 1'!$I$37,IF($B$10=\"kg m\",B129/'Worksheet 1'!$I$37,IF($B$10=\"m\",B129,\"error\")))","v":"error"},{"$f":"(E134-E129)/5","v":{"$error":"#VALUE!"}},0,{"$nulls":46},115,"error","X",{"$error":"#VALUE!"},{"$error":"#VALUE!"},null,115,"error","X"]
[116,null,{"$error":"#VALUE!"},{"$f":"E130*'Worksheet 1'!$I$37","v":{"$error":"#VALUE!"}},{"$f":"E129+F129","v":{"$error":"#VALUE!"}},null,0,{"$nulls":46},116,{"$error":"#VALUE!"},{"$error":"#VALUE!"},{"$error":"#VALUE!"},{"$error":"#VALUE!"},null,116,{"$error":"#VALUE!"},{"$error":"#VALUE!"}]
[117,null,{"$error":"#VALUE!"},{"$f":"E131*'Worksheet 1'!$I$37","v":{"$error":"#VALUE!"}},{"$f":"E130+F129","v":{"$error":"#VALUE!"}},null,0,{"$nulls":46},117,{"$error":"#VALUE!"},{"$error":"#VALUE!"},{"$error":"#VALUE!"},{"$error":"#VALUE!"},null,117,{"$error":"#VALUE!"},{"$error":"#VALUE!"}]
[118,null,{"$error":"#VALUE!"},{"$f":"E132*'Worksheet 1'!$I$37","v":{"$error":"#VALUE!"}},{"$f":"E131+F129","v":{"$error":"#VALUE!"}},null,0,{"$nulls":46},118,{"$error":"#VALUE!"},{"$error":"#VALUE!"},{"$error":"#VALUE!"},{"$error":"#VALUE!"},null,118,{"$error":"#VALUE!"},{"$error":"#VALUE!"}]
[119,null,{"$error":"#VALUE!"},{"$f":"E133*'Worksheet 1'!$I$37","v":{"$error":"#VALUE!"}},{"$f":"E132+F129","v":{"$error":"#VALUE!"}},null,0,{"$nulls":46},119,{"$error":"#VALUE!"},{"$error":"#VALUE!"},{"$error":"#VALUE!"},{"$error":"#VALUE!"},null,119,{"$error":"#VALUE!"},{"$error":"#VALUE!"}]
[120,null,{"$error":"#VALUE!"},{"$f":"E134*'Worksheet 1'!$I$37","v":{"$error":"#VALUE!"}},{"$f":"IF($B$10=\"N m\",B134/9.806/'Worksheet 1'!$I$37,IF($B$10=\"kg m\",B134/'Worksheet 1'!$I$37,IF($B$10=\"m\",B134,\"error\")))","v":"error"},{"$f":"(E139-E134)/5","v":{"$error":"#VALUE!"}},0,{"$nulls":46},120,"error","X",{"$error":"#VALUE!"},{"$error":"#VALUE!"},null,120,"error","X"]
[121,null,{"$error":"#VALUE!"},{"$f":"E135*'Worksheet 1'!$I$37","v":{"$error":"#VALUE!"}},{"$f":"E134+F134","v":{"$error":"#VALUE!"}},null,0,{"$nulls":46},121,{"$error":"#VALUE!"},{"$error":"#VALUE!"},{"$error":"#VALUE!"},{"$error":"#VALUE!"},null,121,{"$error":"#VALUE!"},{"$error":"#VALUE!"}]
[122,null,{"$error":"#VALUE!"},{"$f":"E136*'Worksheet 1'!$I$37","v":{"$error":"#VALUE!"}},{"$f":"E135+F134","v":{"$error":"#VALUE!"}},null,0,{"$nulls":46},122,{"$error":"#VALUE!"},{"$error":"#VALUE!"},{"$error":"#VALUE!"},{"$error":"#VALUE!"},null,122,{"$error":"#VALUE!"},{"$error":"#VALUE!"}]
[123,null,{"$error":"#VALUE!"},{"$f":"E137*'Worksheet 1'!$I$37","v":{"$error":"#VALUE!"}},{"$f":"E136+F134","v":{"$error":"#VALUE!"}},null,0,{"$nulls":46},123,{"$error":"#VALUE!"},{"$error":"#VALUE!"},{"$error":"#VALUE!"},{"$error":"#VALUE!"},null,123,{"$error":"#VALUE!"},{"$error":"#VALUE!"}]
[124,null,{"$error":"#VALUE!"},{"$f":"E138*'Worksheet 1'!$I$37","v":{"$error":"#VALUE!"}},{"$f":"E137+F134","v":{"$error":"#VALUE!"}},null,0,{"$nulls":46},124,{"$error":"#VALUE!"},{"$error":"#VALUE!"},{"$error":"#VALUE!"},{"$error":"#VALUE!"},null,124,{"$error":"#VALUE!"},{"$error":"#VALUE!"}]
[125,null,{"$error":"#VALUE!"},{"$f":"E139*'Worksheet 1'!$I$37","v":{"$error":"#VALUE!"}},{"$f":"IF($B$10=\"N m\",B139/9.806/'Worksheet 1'!$I$37,IF($B$10=\"kg m\",B139/'Worksheet 1'!$I$37,IF($B$10=\"m\",B139,\"error\")))","v":"error"},{"$f":"(E144-E139)/5","v":{"$error":"#VALUE!"}},0,{"$nulls":46},125,"error","X",{"$error":"#VALUE!"},{"$error":"#VALUE!"},null,125,"error","X"]
[126,null,{"$error":"#VALUE!"},{"$f":"E140*'Worksheet 1'!$I$37","v":{"$error":"#VALUE!"}},{"$f":"E139+F139","v":{"$error":"#VALUE!"}},null,0,{"$nulls":46},126,{"$error":"#VALUE!"},{"$error":"#VALUE!"},{"$error":"#VALUE!"},{"$error":"#VALUE!"},null,126,{"$error":"#VALUE!"},{"$error":"#VALUE!"}]
[127,null,{"$error":"#VALUE!"},{"$f":"E141*'Worksheet 1'!$I$37","v":{"$error":"#VALUE!"}},{"$f":"E140+F139","v":{"$error":"#VALUE!"}},null,0,{"$nulls":46},127,{"$error":"#VALUE!"},{"$error":"#VALUE!"},{"$error":"#VALUE!"},{"$error":"#VALUE!"},null,127,{"$error":"#VALUE!"},{"$error":"#VALUE!"}]
[128,null,{"$error":"#VALUE!"},{"$f":"E142*'Worksheet 1'!$I$37","v":{"$error":"#VALUE!"}},{"$f":"E141+F139","v":{"$error":"#VALUE!"}},null,0,{"$nulls":46},128,{"$error":"#VALUE!"},{"$f":"IF(BC142>0,\"X\",\"\")","v":{"$error":"#VALUE!"}},{"$f":"IF(AND(BD142=\"X\",BD143=\"\"),BB142,\"\")","v":{"$error":"#VALUE!"}},{"$error":"#VALUE!"},null,128,{"$error":"#VALUE!"},{"$f":"IF(BI142>=0,\"X\",\"\")","v":{"$error":"#VALUE!"}}]
[129,null,{"$error":"#VALUE!"},{"$f":"E143*'Worksheet 1'!$I$37","v":{"$error":"#VALUE!"}},{"$f":"E142+F139","v":{"$error":"#VALUE!"}},null,0,{"$nulls":46},129,{"$error":"#VALUE!"},{"$error":"#VALUE!"},{"$error":"#VALUE!"},{"$f":"IF(AND(BB143<=$BC$177,BD143=\"X\"),E143,\"\")","v":{"$error":"#VALUE!"}},null,129,{"$f":"IF(E143>=0,E143,\"\")","v":{"$error":"#VALUE!"}},{"$error":"#VALUE!"}]
[130,null,{"$error":"#VALUE!"},{"$f":"E144*'Worksheet 1'!$I$37","v":{"$error":"#VALUE!"}},{"$f":"IF($B$10=\"N m\",B144/9.806/'Worksheet 1'!$I$37,IF($B$10=\"kg m\",B144/'Worksheet 1'!$I$37,IF($B$10=\"m\",B144,\"error\")))","v":"error"},{"$f":"(E149-E144)/5","v":{"$error":"#VALUE!"}},0,{"$nulls":46},130,"error","X",{"$error":"#VALUE!"},{"$error":"#VALUE!"},null,130,"error","X"]
[131,null,{"$error":"#VALUE!"},{"$f":"E145*'Worksheet 1'!$I$37","v":{"$error":"#VALUE!"}},{"$f":"E144+F144","v":{"$error":"#VALUE!"}},null,0,{"$nulls":46},131,{"$error":"#VALUE!"},{"$error":"#VALUE!"},{"$error":"#VALUE!"},{"$error":"#VALUE!"},null,131,{"$error":"#VALUE!"},{"$error":"#VALUE!"}]
[132,null,{"$error":"#VALUE!"},{"$f":"E146*'Worksheet 1'!$I$37","v":{"$error":"#VALUE!"}},{"$f":"E145+F144","v":{"$error":"#VALUE!"}},null,0,{"$nulls":46},132,{"$error":"#VALUE!"},{"$error":"#VALUE!"},{"$error":"#VALUE!"},{"$error":"#VALUE!"},null,132,{"$error":"#VALUE!"},{"$error":"#VALUE!"}]
[133,null,{"$error":"#VALUE!"},{"$f":"E147*'Worksheet 1'!$I$37","v":{"$error":"#VALUE!"}},{"$f":"E146+F144","v":{"$error":"#VALUE!"}},null,0,{"$nulls":46},133,{"$error":"#VALUE!"},{"$error":"#VALUE!"},{"$error":"#VALUE!"},{"$error":"#VALUE!"},null,133,{"$error":"#VALUE!"},{"$error":"#VALUE!"}]
[134,null,{"$error":"#VALUE!"},{"$f":"E148*'Worksheet 1'!$I$37","v":{"$error":"#VALUE!"}},{"$f":"E147+F144","v":{"$error":"#VALUE!"}},null,0,{"$nulls":46},134,{"$error":"#VALUE!"},{"$error":"#VALUE!"},{"$error":"#VALUE!"},{"$error":"#VALUE!"},null,134,{"$error":"#VALUE!"},{"$error":"#VALUE!"}]
[135,null,{"$error":"#VALUE!"},{"$f":"E149*'Worksheet 1'!$I$37","v":{"$error":"#VALUE!"}},{"$f":"IF($B$10=\"N m\",B149/9.806/'Worksheet 1'!$I$37,IF($B$10=\"kg m\",B149/'Worksheet 1'!$I$37,IF($B$10=\"m\",B149,\"error\")))","v":"error"},{"$f":"(E154-E149)/5","v":{"$error":"#VALUE!"}},0,{"$nulls":46},135,{"$f":"E149","v":"error"},"X",{"$error":"#VALUE!"},{"$error":"#VALUE!"},null,135,"error","X"]
[136,null,{"$error":"#VALUE!"},{"$f":"E150*'Worksheet 1'!$I$37","v":{"$error":"#VALUE!"}},{"$f":"E149+F149","v":{"$error":"#VALUE!"}},null,0,{"$nulls":46},136,{"$error":"#VALUE!"},{"$error":"#VALUE!"},{"$error":"#VALUE!"},{"$error":"#VALUE!"},null,136,{"$error":"#VALUE!"},{"$error":"#VALUE!"}]
[137,null,{"$error":"#VALUE!"},{"$f":"E151*'Worksheet 1'!$I$37","v":{"$error":"#VALUE!"}},{"$f":"E150+F149","v":{"$error":"#VALUE!"}},null,0,{"$nulls":46},137,{"$error":"#VALUE!"},{"$error":"#VALUE!"},{"$error":"#VALUE!"},{"$error":"#VALUE!"},null,137,{"$error":"#VALUE!"},{"$error":"#VALUE!"}]
[138,null,{"$error":"#VALUE!"},{"$f":"E152*'Worksheet 1'!$I$37","v":{"$error":"#VALUE!"}},{"$f":"E151+F149","v":{"$error":"#VALUE!"}},null,0,{"$nulls":46},138,{"$error":"#VALUE!"},{"$error":"#VALUE!"},{"$error":"#VALUE!"},{"$error":"#VALUE!"},null,138,{"$error":"#VALUE!"},{"$error":"#VALUE!"}]
[139,null,{"$error":"#VALUE!"},{"$f":"E153*'Worksheet 1'!$I$37","v":{"$error":"#VALUE!"}},{"$f":"E152+F149","v":{"$error":"#VALUE!"}},null,0,{"$nulls":46},139,{"$error":"#VALUE!"},{"$error":"#VALUE!"},{"$error":"#VALUE!"},{"$error":"#VALUE!"},null,139,{"$error":"#VALUE!"},{"$error":"#VALUE!"}]
[140,null,{"$error":"#VALUE!"},{"$f":"E154*'Worksheet 1'!$I$37","v":{"$error":"#VALUE!"}},{"$f":"IF($B$10=\"N m\",B154/9.806/'Worksheet 1'!$I$37,IF($B$10=\"kg m\",B154/'Worksheet 1'!$I$37,IF($B$10=\"m\",B154,\"error\")))","v":"error"},{"$f":"(E159-E154)/5","v":{"$error":"#VALUE!"}},0,{"$nulls":46},140,"error","X",{"$error":"#VALUE!"},{"$error":"#VALUE!"},null,140,"error","X"]
[141,null,{"$error":"#VALUE!"},{"$f":"E155*'Worksheet 1'!$I$37","v":{"$error":"#VALUE!"}},{"$f":"E154+F154","v":{"$error":"#VALUE!"}},null,0,{"$nulls":46},141,{"$error":"#VALUE!"},{"$error":"#VALUE!"},{"$error":"#VALUE!"},{"$error":"#VALUE!"},null,141,{"$error":"#VALUE!"},{"$error":"#VALUE!"}]
[142,null,{"$error":"#VALUE!"},{"$f":"E156*'Worksheet 1'!$I$37","v":{"$error":"#VALUE!"}},{"$f":"E155+F154","v":{"$error":"#VALUE!"}},null,0,{"$nulls":46},142,{"$error":"#VALUE!"},{"$error":"#VALUE!"},{"$error":"#VALUE!"},{"$error":"#VALUE!"},null,142,{"$error":"#VALUE!"},{"$error":"#VALUE!"}]
[143,null,{"$error":"#VALUE!"},{"$f":"E157*'Worksheet 1'!$I$37","v":{"$error":"#VALUE!"}},{"$f":"E156+F154","v":{"$error":"#VALUE!"}},null,0,{"$nulls":46},143,{"$error":"#VALUE!"},{"$error":"#VALUE!"},{"$error":"#VALUE!"},{"$error":"#VALUE!"},null,143,{"$error":"#VALUE!"},{"$error":"#VALUE!"}]
[144,null,{"$error":"#VALUE!"},{"$f":"E158*'Worksheet 1'!$I$37","v":{"$error":"#VALUE!"}},{"$f":"E157+F154","v":{"$error":"#VALUE!"}},null,0,{"$nulls":46},144,{"$error":"#VALUE!"},{"$error":"#VALUE!"},{"$error":"#VALUE!"},{"$error":"#VALUE!"},null,144,{"$error":"#VALUE!"},{"$error":"#VALUE!"}]
[145,null,{"$error":"#VALUE!"},{"$f":"E159*'Worksheet 1'!$I$37","v":{"$error":"#VALUE!"}},{"$f":"IF($B$10=\"N m\",B159/9.806/'Worksheet 1'!$I$37,IF($B$10=\"kg m\",B159/'Worksheet 1'!$I$37,IF($B$10=\"m\",B159,\"error\")))","v":"error"},{"$f":"(E164-E159)/5","v":{"$error":"#VALUE!"}},0,{"$nulls":46},145,"error","X",{"$error":"#VALUE!"},{"$error":"#VALUE!"},null,145,"error","X"]
[146,null,{"$error":"#VALUE!"},{"$f":"E160*'Worksheet 1'!$I$37","v":{"$error":"#VALUE!"}},{"$f":"E159+F159","v":{"$error":"#VALUE!"}},null,0,{"$nulls":46},146,{"$error":"#VALUE!"},{"$error":"#VALUE!"},{"$error":"#VALUE!"},{"$error":"#VALUE!"},null,146,{"$error":"#VALUE!"},{"$error":"#VALUE!"}]
[147,null,{"$error":"#VALUE!"},{"$f":"E161*'Worksheet 1'!$I$37","v":{"$error":"#VALUE!"}},{"$f":"E160+F159","v":{"$error":"#VALUE!"}},null,0,{"$nulls":46},147,{"$error":"#VALUE!"},{"$error":"#VALUE!"},{"$error":"#VALUE!"},{"$error":"#VALUE!"},null,147,{"$error":"#VALUE!"},{"$error":"#VALUE!"}]
[148,null,{"$error":"#VALUE!"},{"$f":"E162*'Worksheet 1'!$I$37","v":{"$error":"#VALUE!"}},{"$f":"E161+F159","v":{"$error":"#VALUE!"}},null,0,{"$nulls":46},148,{"$error":"#VALUE!"},{"$error":"#VALUE!"},{"$error":"#VALUE!"},{"$error":"#VALUE!"},null,148,{"$error":"#VALUE!"},{"$error":"#VALUE!"}]
[149,null,{"$error":"#VALUE!"},{"$f":"E163*'Worksheet 1'!$I$37","v":{"$error":"#VALUE!"}},{"$f":"E162+F159","v":{"$error":"#VALUE!"}},null,0,{"$nulls":46},149,{"$error":"#VALUE!"},{"$error":"#VALUE!"},{"$error":"#VALUE!"},{"$error":"#VALUE!"},null,149,{"$error":"#VALUE!"},{"$error":"#VALUE!"}]
[150,null,{"$error":"#VALUE!"},{"$f":"E164*'Worksheet 1'!$I$37","v":{"$error":"#VALUE!"}},{"$f":"IF($B$10=\"N m\",B164/9.806/'Worksheet 1'!$I$37,IF($B$10=\"kg m\",B164/'Worksheet 1'!$I$37,IF($B$10=\"m\",B164,\"error\")))","v":"error"},{"$f":"(E169-E164)/5","v":{"$error":"#VALUE!"}},0,{"$nulls":46},150,"error","X",{"$error":"#VALUE!"},{"$error":"#VALUE!"},null,150,"error","X"]
[151,null,{"$error":"#VALUE!"},{"$f":"E165*'Worksheet 1'!$I$37","v":{"$error":"#VALUE!"}},{"$f":"E164+F164","v":{"$error":"#VALUE!"}},null,0,{"$nulls":46},151,{"$error":"#VALUE!"},{"$error":"#VALUE!"},{"$error":"#VALUE!"},{"$error":"#VALUE!"},null,151,{"$error":"#VALUE!"},{"$error":"#VALUE!"}]
[152,null,{"$error":"#VALUE!"},{"$f":"E166*'Worksheet 1'!$I$37","v":{"$error":"#VALUE!"}},{"$f":"E165+F164","v":{"$error":"#VALUE!"}},null,0,{"$nulls":46},152,{"$error":"#VALUE!"},{"$error":"#VALUE!"},{"$error":"#VALUE!"},{"$error":"#VALUE!"},null,152,{"$error":"#VALUE!"},{"$error":"#VALUE!"}]
[153,null,{"$error":"#VALUE!"},{"$f":"E167*'Worksheet 1'!$I$37","v":{"$error":"#VALUE!"}},{"$f":"E166+F164","v":{"$error":"#VALUE!"}},null,0,{"$nulls":46},153,{"$error":"#VALUE!"},{"$error":"#VALUE!"},{"$error":"#VALUE!"},{"$error":"#VALUE!"},null,153,{"$error":"#VALUE!"},{"$error":"#VALUE!"}]
[154,null,{"$error":"#VALUE!"},{"$f":"E168*'Worksheet 1'!$I$37","v":{"$error":"#VALUE!"}},{"$f":"E167+F164","v":{"$error":"#VALUE!"}},null,0,{"$nulls":46},154,{"$error":"#VALUE!"},{"$error":"#VALUE!"},{"$error":"#VALUE!"},{"$error":"#VALUE!"},null,154,{"$error":"#VALUE!"},{"$error":"#VALUE!"}]
[155,null,{"$error":"#VALUE!"},{"$f":"E169*'Worksheet 1'!$I$37","v":{"$error":"#VALUE!"}},{"$f":"IF($B$10=\"N m\",B169/9.806/'Worksheet 1'!$I$37,IF($B$10=\"kg m\",B169/'Worksheet 1'!$I$37,IF($B$10=\"m\",B169,\"error\")))","v":"error"},{"$f":"(E174-E169)/5","v":{"$error":"#VALUE!"}},0,{"$nulls":46},155,"error","X",{"$error":"#VALUE!"},{"$error":"#VALUE!"},null,155,"error","X"]
[156,null,{"$error":"#VALUE!"},{"$f":"E170*'Worksheet 1'!$I$37","v":{"$error":"#VALUE!"}},{"$f":"E169+F169","v":{"$error":"#VALUE!"}},null,0,{"$nulls":46},156,{"$error":"#VALUE!"},{"$error":"#VALUE!"},{"$error":"#VALUE!"},{"$error":"#VALUE!"},null,156,{"$error":"#VALUE!"},{"$error":"#VALUE!"}]
[157,null,{"$error":"#VALUE!"},{"$f":"E171*'Worksheet 1'!$I$37","v":{"$error":"#VALUE!"}},{"$f":"E170+F169","v":{"$error":"#VALUE!"}},null,0,{"$nulls":46},157,{"$error":"#VALUE!"},{"$error":"#VALUE!"},{"$error":"#VALUE!"},{"$error":"#VALUE!"},null,157,{"$error":"#VALUE!"},{"$error":"#VALUE!"}]
[158,null,{"$error":"#VALUE!"},{"$f":"E172*'Worksheet 1'!$I$37","v":{"$error":"#VALUE!"}},{"$f":"E171+F169","v":{"$error":"#VALUE!"}},null,0,{"$nulls":46},158,{"$error":"#VALUE!"},{"$error":"#VALUE!"},{"$error":"#VALUE!"},{"$error":"#VALUE!"},null,158,{"$error":"#VALUE!"},{"$error":"#VALUE!"}]
[159,null,{"$error":"#VALUE!"},{"$f":"E173*'Worksheet 1'!$I$37","v":{"$error":"#VALUE!"}},{"$f":"E172+F169","v":{"$error":"#VALUE!"}},null,0,{"$nulls":46},159,{"$error":"#VALUE!"},{"$error":"#VALUE!"},{"$error":"#VALUE!"},{"$error":"#VALUE!"},null,159,{"$error":"#VALUE!"},{"$error":"#VALUE!"}]
[160,null,{"$error":"#VALUE!"},{"$f":"E174*'Worksheet 1'!$I$37","v":{"$error":"#VALUE!"}},{"$f":"IF($B$10=\"N m\",B174/9.806/'Worksheet 1'!$I$37,IF($B$10=\"kg m\",B174/'Worksheet 1'!$I$37,IF($B$10=\"m\",B174,\"error\")))","v":"error"},{"$f":"(E179-E174)/5","v":{"$error":"#VALUE!"}},0,{"$nulls":46},160,"error",{"$f":"IF(BC174>0,\"X\",\"\")","v":"X"},{"$f":"IF(AND(BD174=\"X\",BD175=\"\"),BB174,\"\")","v":160},{"$error":"#VALUE!"},null,160,{"$f":"IF(E174=\"\",\"\",IF(E174>=0,E174,\"\"))","v":"error"},"X"]
[]
["Angle of vanishing stability",null,null,"Area under GZ curve",{"$nulls":50},"Bestimmung Phi V",null,null,"Fläche"]
[{"$f":"BC184","v":{"$error":"#VALUE!"}},null,"degrees",{"$f":"BF177","v":{"$error":"#VALUE!"}},{"$nulls":3},"m deg",{"$nulls":46},{"$f":"MAX(BE14:BE174)","v":{"$error":"#VALUE!"}},{"$f":"LOOKUP(BC177,$BB$14:$BB$174,$BC$14:$BC$174)","v":{"$error":"#VALUE!"}},null,{"$f":"SUM(BF14:BF174)","v":{"$error":"#VALUE!"}}]
[{"$nulls":54},{"$f":"BC177+1","v":{"$error":"#VALUE!"}},{"$f":"LOOKUP(BC178,$BB$14:$BB$174,$BC$14:$BC$174)","v":{"$error":"#VALUE!"}}]
[]
[{"$nulls":54},"Nachkommastelle Phi V"]
[{"$nulls":54},{"$f":"(-1)*BD177/((-1)*BD177+BD178)","v":{"$error":"#VALUE!"}}]
[]
[{"$nulls":54},"Phi V"]
[{"$nulls":54},{"$f":"BC177+BC181","v":{"$error":"#VALUE!"}}]

{"sheet":"Worksheet 7a","index":11,"n_rows":45,"n_cols":52,"rows_kept":45,"merged":[[0,8,0,9],[2,0,2,6],[4,0,4,6],[8,0,11,0],[9,4,9,5],[12,0,15,0],[13,1,14,1],[13,2,14,2],[13,3,14,3],[13,4,14,4],[13,5,14,5],[13,6,14,6],[16,0,23,0],[17,4,17,5],[20,1,22,1],[20,2,22,2],[20,3,22,3],[20,4,22,4],[20,5,22,5],[20,6,22,6],[24,0,29,0],[27,1,28,1],[27,2,28,2],[27,3,28,3],[27,4,28,4],[27,5,28,5],[27,6,28,6],[30,0,35,0],[30,4,30,5],[33,1,34,1],[33,2,34,2],[33,3,34,3],[33,4,34,4],[33,5,34,5],[33,6,34,6],[36,0,43,0],[37,1,37,6],[40,1,41,1],[40,2,41,2],[40,3,41,3],[40,4,41,4],[40,5,41,5],[40,6,41,6]]}
[{"$nulls":8},"Comments"]
[{"$nulls":9},"Derived values"]
["ISO 12217-2:2017  CALCULATION WORKSHEET No. 7a                                    STABILITY INDEX",{"$nulls":8},"Input values"]
[]
[{"$f":"CONCATENATE(coverSheet!B5,\"          \",coverSheet!B12)","v":"          "}]
[]
["Stability Index (STIX):",{"$nulls":3},"complete both columns"]
["Factor","Item","Symbol","Unit","mMO","mLA","Ref."]
["FDS\n(6.6.2)","Positive area under GZ curve to ΦV ","AGZ","m deg.",{"$f":"'Worksheet 6a'!D177","v":{"$error":"#VALUE!"}},{"$f":"'Worksheet 6b'!D177","v":{"$error":"#VALUE!"}},"6.6.2"]
[null,"Length of hull","LH","m",{"$f":"'Worksheet 1'!I10","v":{"v":0,"d":"0.00"}},null,"3.4.1"]
[null,"Factor as calculated = AGZ /(15,81 (LH)0,5 )               ","FDS","—",{"$f":"E9/15.81/SQRT(E10)","v":{"$error":"#VALUE!"}},{"$f":"F9/15.81/SQRT(E10)","v":{"$error":"#VALUE!"}},"6.6.2"]
[null,"FDS when limited to the range 0,5 to 1,5","FDS","—",{"$f":"IF(E11<0.5,0.5,IF(E11>1.5,1.5,E11))","v":{"$error":"#VALUE!"}},{"$f":"IF(F11<0.5,0.5,IF(F11>1.5,1.5,F11))","v":{"$error":"#VALUE!"}},"6.6.2"]
["FIR\n(6.6.3)","Angle of vanishing stability","ΦV",null,{"$f":"'Worksheet 6a'!A177","v":{"$error":"#VALUE!"}},{"$f":"'Worksheet 6b'!A177","v":{"$error":"#VALUE!"}},"3.4.10"]
[null,"If m<40.000, FIR = ΦV  / (125 - m / 1600)\nIf m>40.000. FIR = ΦV / 100","FIR",null,{"$f":"IF('Worksheet 1'!I44<40000,'Worksheet 7a'!E13/(125-'Worksheet 1'!I44/1600),'Worksheet 7a'!E13/100)","v":{"$error":"#VALUE!"}},{"$f":"IF('Worksheet 1'!I37<40000,'Worksheet 7a'!F13/(125-'Worksheet 1'!I37/1600),'Worksheet 7a'!F13/100)","v":{"$error":"#VALUE!"}},"6.6.3"]
[]
[null,"FIR when limited to the range 0,4 to 1,5","FIR",null,{"$f":"IF(E14<0.4,0.4,IF(E14>1.5,1.5,E14))","v":{"$error":"#VALUE!"}},{"$f":"IF(F14<0.4,0.4,IF(F14>1.5,1.5,F14))","v":{"$error":"#VALUE!"}},"6.6.3"]
["FKR\n(6.6.4)","Righting lever at 90° heel","GZ90","m",{"$f":"'Worksheet 6a'!E104","v":"error"},{"$f":"'Worksheet 6b'!E104","v":"error"},"6.6.4"]
[null,"Reference sail area (see ISO 8666)","AS","m2",{"$f":"'Worksheet 1'!I47","v":0},null,"3.4.8"]
[null,"Height of centre of area of AS above waterline","hCE","m",null,null,"6.6.4"]
[null,"Calculate FR = (GZ90 m)/(2 AS hCE)","FR","—",{"$f":"IF(E19=\"\",\"\",E17*'Worksheet 1'!I44/(2*$E$18*'Worksheet 7a'!E19))","v":""},{"$f":"IF(F19=\"\",\"\",F17*'Worksheet 1'!I37/(2*$E$18*'Worksheet 7a'!F19))","v":""},"6.6.4"]
[null,"If FR ≥ 1,5,   FKR = (0,875 + 0,0833 FR)\nIf FR < 1,5,   FKR = (0,5 + 0,333 FR)\nIf  ΦV  < 90°,   FKR = 0,5","FKR","—",{"$f":"IF(E20>=1.5,0.875+0.0833*E20,IF(E13<90,0.5,0.5+0.33*E20))","v":{"$error":"#VALUE!"}},{"$f":"IF(F20>=1.5,0.875+0.0833*F20,IF(F13<90,0.5,0.5+0.33*F20))","v":{"$error":"#VALUE!"}},"6.6.4"]
[{"$nulls":50},"list:","opening not a recess"]
[{"$nulls":51},"quick- draining"]
[null,"FKR when limited to the range 0,5 to 1,5","FKR","—",{"$f":"IF(E21<0.5,0.5,IF(E21>1.5,1.5,E21))","v":{"$error":"#VALUE!"}},{"$f":"IF(F21<0.5,0.5,IF(F21>1.5,1.5,F21))","v":{"$error":"#VALUE!"}},"6.6.4",{"$nulls":44},"not quick- draining"]
["FDL\n(6.6.5)","Length waterline","LWL","m",null,{"$f":"'Worksheet 1'!I11","v":{"v":0,"d":"0.00"}},"3.4.2"]
[null,"Length base size LBS = (2 LWL + LH) / 3","LBS","m",{"$f":"(2*E25+E10)/3","v":0},{"$f":"(2*F25+E10)/3","v":{"v":0,"d":"0.00"}},"6.6.5"]
[null,"Calculate FL = (LBS  /11) 0,2","FL","—",{"$f":"(E26/11)^0.2","v":{"v":0,"d":"0.000"}},{"$f":"(F26/11)^0.2","v":{"v":0,"d":"0.000"}},"6.6.5"]
[null,"Calculate FDL = ","FDL","—",{"$f":"(0.6+(15*'Worksheet 1'!I44*'Worksheet 7a'!E27/('Worksheet 7a'!E26^3*(333-8*'Worksheet 7a'!E26))))^0.5","v":{"$error":"#DIV/0!"}},{"$f":"(0.6+(15*'Worksheet 1'!I37*'Worksheet 7a'!F27/('Worksheet 7a'!F26^3*(333-8*'Worksheet 7a'!F26))))^0.5","v":{"$error":"#DIV/0!"}},"6.6.5"]
[]
[null,"FDL when limited to the range 0,75 to 1,25","FDL","—",{"$f":"IF(E28<0.75,0.75,IF(E28>1.25,1.25,E28))","v":{"$error":"#DIV/0!"}},{"$f":"IF(F28<0.75,0.75,IF(F28>1.25,1.25,F28))","v":{"$error":"#DIV/0!"}},"6.6.5"]
["FBD\n(6.6.6)","Beam of Hull","BH","m",{"$f":"'Worksheet 2'!I12","v":0},null,"3.4.3"]
[null,"Beam Waterline","BWL","m",null,null,"3.4.4"]
[null,"Calculate FB= 3,3 BH / (0,03 m)1/3","FB","—",{"$f":"3.3*E31/(0.03*'Worksheet 1'!I44)^(1/3)","v":{"$error":"#DIV/0!"}},{"$f":"3.3*E31/(0.03*'Worksheet 1'!I37)^(1/3)","v":{"$error":"#DIV/0!"}},"6.6.6",{"$nulls":44},"sAbfragetabelle"]
[null,"If FB > 2,20 FBD = [ 13,31 BWL / (BH FB3)]0,5\nIf FB < 1,45  FBD = [ BW LFB2  / (1,682 BH)]0,5\nOtherwise FBD = 1,118 (BWL/BH)0,5","FDB","—",{"$f":"IF(E33>2.2,SQRT(13.31*E32/E31/E33^3),IF(E33<1.45,SQRT(E32*E33^2/1.682/E31),1.118*SQRT(E32/E31)))","v":{"$error":"#DIV/0!"}},{"$f":"IF(F33>2.2,SQRT(13.31*F32/E31/F33^3),IF(F33<1.45,SQRT(F32*F33^2/1.682/E31),1.118*SQRT(F32/E31)))","v":{"$error":"#DIV/0!"}},"6.6.6"]
[]
[null,"FBD when limited to the range 0,75 to 1,25","FDB","—",{"$f":"IF(E34<0.75,0.75,IF(E34>1.25,1.25,E34))","v":{"$error":"#DIV/0!"}},{"$f":"IF(F34<0.75,0.75,IF(F34>1.25,1.25,F34))","v":{"$error":"#DIV/0!"}},"6.6.6"]
["FWM\n(6.6.7)","Downflooding angle = lesser of ΦDC and ΦDH","ΦDW","degree",{"$f":"IF('Worksheet 3'!H41=\"\",\"\",MIN('Worksheet 3'!H39,'Worksheet 3'!H41))","v":""},{"$f":"IF('Worksheet 3'!H41=\"\",\"\",MIN('Worksheet 3'!H40,'Worksheet 3'!H42))","v":""},"3.3.2",null,"please insert downflooding angles in worksheet 3"]
[null,"If ΦDW ≥ 90° (see worksheet 3) then  FWM = 1,0 , If ΦDW is less than 90° then:"]
[null,"Righting lever at downflooding angle","GZDW","m",{"$f":"LOOKUP(E37,'Worksheet 6a'!A14:A174,'Worksheet 6a'!E14:E174)","v":{"$error":"#N/A"}},{"$f":"LOOKUP(F37,'Worksheet 6b'!A14:A174,'Worksheet 6b'!E14:E174)","v":{"$error":"#N/A"}},"6.6.7",null,"please insert curves of righting moment in worksheet 6a, 6b"]
[null,"Lever from centre of sail area to underwater profile","hCE + hLP","m",null,null,"6.6.7"]
[null,"Calc. wind speed at which serious flooding occurs \n= {13 m GZDW / [AS (hCE+hLP) |cos ΦDW |1,3 ] }0,5","vAW","m / s",{"$f":"SQRT(13*'Worksheet 1'!I44*'Worksheet 7a'!E39/('Worksheet 7a'!E18*'Worksheet 7a'!E40*(ABS(COS(RADIANS('Worksheet 7a'!E37))))^1.3))","v":{"$error":"#N/A"}},{"$f":"SQRT(13*'Worksheet 1'!I37*'Worksheet 7a'!F39/('Worksheet 7a'!E18*'Worksheet 7a'!F40*(ABS(COS(RADIANS('Worksheet 7a'!F37))))^1.3))","v":{"$error":"#N/A"}},"6.6.7"]
[]
[null,"If ΦDW < 90o, FWM = vAW/17; if ΦDW ≥ 90°, FWM = 1,0","FWM","—",{"$f":"IF(E37>=90,1,E41/17)","v":{"v":1,"d":"1.000"}},{"$f":"IF(F37>=90,1,F41/17)","v":{"v":1,"d":"1.000"}},"6.6.7"]
[null,"FWM when limited to the range 0,5 to 1,0","FWM","—",{"$f":"IF(E43<0.5,0.5,IF(E43>1,1,E43))","v":{"v":1,"d":"1.000"}},{"$f":"IF(F43<0.5,0.5,IF(F43>1,1,F43))","v":{"v":1,"d":"1.000"}},"6.6.7"]
["to be continued on worksheeet 7b"]

{"sheet":"Worksheet 7b)","index":12,"n_rows":25,"n_cols":52,"rows_kept":25,"merged":[[0,8,0,9],[2,0,2,6],[4,0,4,6],[8,0,17,0],[10,4,10,5],[16,1,16,2],[19,0,19,6],[20,0,20,1],[21,0,21,1],[22,0,22,1],[23,0,23,1],[24,0,25,3],[24,4,25,4],[24,5,25,5],[24,6,25,6]]}
[{"$nulls":8},"Comments"]
[{"$nulls":9},"Derived values"]
["ISO 12217-2:2017  CALCULATION WORKSHEET No. 7b    (continued)                STABILITY INDEX",{"$nulls":8},"Input values"]
[{"$nulls":30},"list"]
[{"$f":"CONCATENATE(coverSheet!B5,\"          \",coverSheet!B12)","v":"          "},{"$nulls":29},"Yes"]
[{"$nulls":30},"No"]
["Stability Index (STIX):",{"$nulls":3},"complete both columns"]
["Factor","Item","Symbol","Unit","mMO","mLA","Ref."]
["FDF\n(6.6.8)","Downflooding angle to non-quickdraining cockpit","ΦDC","degree",{"$f":"IF('Worksheet 3'!H39=\"\",\"\",'Worksheet 3'!H39)","v":""},{"$f":"IF('Worksheet 3'!H40=\"\",\"\",'Worksheet 3'!H40)","v":""},"3.3.2"]
[null,"Downflooding angle to main access hatch","ΦDH","degree",{"$f":"'Worksheet 3'!H41","v":{"v":0,"d":"0.0"}},{"$f":"'Worksheet 3'!H42","v":{"v":0,"d":"0.0"}},"3.3.2"]
[null,"Total area of openings for findig ΦDA = (1,2 LH BH FM)",null,"cm2",{"$f":"1.2*'Worksheet 1'!I10*'Worksheet 2'!I12*'Worksheet 4'!E22","v":{"v":0,"d":"0.000"}},null,"3.3.2",null,"please insert FM at worksheet 4"]
[null,"Downflooding angle at which above area is immersed","ΦDA","degree",null,null,"3.3.3"]
[null,"Angle of vanishing stability","ΦV","degree",{"$f":"'Worksheet 6a'!A177","v":{"$error":"#VALUE!"}},{"$f":"'Worksheet 6b'!A177","v":{"$error":"#VALUE!"}},"3.4.10"]
[null,"Least of the above four angles","ΦDF","degree",{"$f":"MIN(E13,E12,E10,E9)","v":{"$error":"#VALUE!"}},{"$f":"MIN(F13,F12,F10,F9)","v":{"$error":"#VALUE!"}},"6.6.8"]
[null,"Then FDF1 = ΦDF / 90",null,null,{"$f":"E14/90","v":{"$error":"#VALUE!"}},{"$f":"F14/90","v":{"$error":"#VALUE!"}},"6.6.8"]
[null,"FDF1 when limited to the range 0,5 to 1,25","FDF1",null,{"$f":"IF(E15<0.5,0.5,IF(E15>1.25,1.25,E15))","v":{"$error":"#VALUE!"}},{"$f":"IF(F15<0.5,0.5,IF(F15>1.25,1.25,F15))","v":{"$error":"#VALUE!"}},"6.6.8"]
[null,"Does boat float acc. to 6.5.2.b) and also when flooded have GZ90 > 0 ?",null,"Yes / No",null,null,"6.6.8"]
[null,"If Yes, calculate final FDF = 1,2 FDF1, otherwise FDF = FDF1","FDF",null,{"$f":"IF(E17=\"Yes\",1.2*E16,E16)","v":{"$error":"#VALUE!"}},{"$f":"IF(F17=\"Yes\",1.2*F16,F16)","v":{"$error":"#VALUE!"}},"6.6.8"]
[]
["Calculation oft STIX and ssignment oft Design Category:"]
["Item",null,"Symbol","Unit","mMO","mLA","Ref."]
["Length base size LBS = ( 2 LWL + LH ) / 3",null,"LBS","m",{"$f":"'Worksheet 7a'!E26","v":{"v":0,"d":"0.000"}},{"$f":"'Worksheet 7a'!F26","v":{"v":0,"d":"0.000"}},"6.6.9"]
["Product of all 7 factors = FDS x FIR x FKR x FDL x FBD x FWM x FDF",null,"F","—",{"$f":"E18*'Worksheet 7a'!E12*'Worksheet 7a'!E16*'Worksheet 7a'!E24*'Worksheet 7a'!E30*'Worksheet 7a'!E36*'Worksheet 7a'!E44","v":{"$error":"#VALUE!"}},{"$f":"F18*'Worksheet 7a'!F12*'Worksheet 7a'!F16*'Worksheet 7a'!F24*'Worksheet 7a'!F30*'Worksheet 7a'!F36*'Worksheet 7a'!F44","v":{"$error":"#VALUE!"}}]
["STIX =  ( 7 + 2,25 LBS ) x F0,5",null,"STIX","—",{"$f":"(7+2.25*E22)*E23^0.5","v":{"$error":"#VALUE!"}},{"$f":"(7+2.25*F22)*F23^0.5","v":{"$error":"#VALUE!"}}]
["Design category possible on STIX:\nA when STIX >32, B when STIX > 23, C when STIX > 14 and D when STIX >5",{"$nulls":3},{"$f":"IF(E24>32,\"A\",IF(E24>23,\"B\",IF(E24>14,\"C\",IF(E24>5,\"D\",\"Fail\"))))","v":{"$error":"#VALUE!"}},{"$f":"IF(F24>32,\"A\",IF(F24>23,\"B\",IF(F24>14,\"C\",IF(F24>5,\"D\",\"Fail\"))))","v":{"$error":"#VALUE!"}},"Table 5",{"$nulls":44},"sAbfragetabelle"]

{"sheet":"Worksheet 8","index":13,"n_rows":22,"n_cols":27,"rows_kept":22,"merged":[[0,6,0,7],[2,0,2,4],[4,0,4,4],[6,0,6,4],[8,3,8,4],[13,0,13,1],[14,0,14,1],[15,0,15,1],[18,0,18,4],[21,0,21,1]]}
[{"$nulls":6},"Comments"]
[{"$nulls":7}," Derived values",{"$nulls":18},"List:"]
["ISO 12217-2:2017 CALCULATION  WORKSHEET No. 8         KNOCKDOWN-RECOVERY TEST",{"$nulls":6}," Input values",{"$nulls":18},"Yes"]
[{"$nulls":26},"No"]
[{"$f":"CONCATENATE(coverSheet!B5,\"          \",coverSheet!B12)","v":"          "}]
[{"$nulls":26},"Water"]
["Design Categories C and D only",{"$nulls":25},"Weights"]
[]
[null,null,"method used: ",{"$nulls":23},"experimental"]
[{"$nulls":26},"theoretical"]
["Item","Symbol","Cat C","Cat D","Ref."]
["Experimental method:    Crew Limit","CL",null,null,"3.6.3"]
["Is boat prepared and persons positioned as in 6.7.2 ?","Yes / No",null,null,"6.7.2"]
["Is water or other weight used instead of persons, if so which?",{"$nulls":3},"6.7.2"]
["Masthead taken to",null,"waterline","horizontal","6.7.3; 6.7.4"]
["Masthead held in position for",null,"60s","10s","6.7.3; 6.7.5"]
["Boat recovers when released ?","Yes / No",null,null,"6.7.3; 6.7.6"]
["Boat floats so it can be pumped or bailed out ?","Yes / No",null,null,"6.7.3; 6.7.7"]
["If boat achieves YES to each of above, Design Category is OK"]
["Alternative theoretical method:",null,null,{"$f":"IF(B20<>\"\",ROUND(B20/C20,3),\"\")","v":""}]
["Is GZ positive at heel angle as defined in 6.7.5 ?                            ","Yes / No",null,null,"6.7.5"]
["Design category given:  ",null,{"$f":"IF(C21=\"Yes\",\"C\",IF(COUNTIF(C13:C18,\"Yes\")=3,\"C\",\"Fail\"))","v":"Fail"},{"$f":"IF(D21=\"Yes\",\"D\",IF(COUNTIF(D13:D18,\"Yes\")=3,\"D\",\"Fail\"))","v":"Fail"}]

{"sheet":"Worksheet 9","index":14,"n_rows":44,"n_cols":52,"rows_kept":44,"merged":[[0,8,0,9],[2,0,2,6],[4,0,4,6],[8,0,8,1],[8,2,8,6],[10,0,10,1],[11,0,11,6],[12,0,12,1],[12,12,12,14],[13,0,13,2],[13,4,13,5],[14,0,14,1],[14,4,14,5],[15,0,15,1],[15,4,15,5],[16,0,16,1],[16,4,16,5],[17,0,17,1],[17,4,17,5],[18,0,18,1],[19,0,19,1],[20,0,20,1],[21,0,21,2],[21,4,21,5],[22,0,23,3],[22,4,23,4],[22,5,23,5],[22,6,23,6],[25,0,25,6],[27,0,27,1],[28,0,28,6],[29,0,29,1],[30,0,30,2],[30,4,30,5],[31,0,31,2],[31,4,31,5],[32,0,32,2],[33,0,33,1],[34,0,34,1],[35,0,35,1],[36,0,36,1],[37,0,37,1],[38,0,38,2],[39,0,39,2],[39,4,39,5],[40,0,41,3],[40,4,41,4],[40,5,41,5],[40,6,41,6],[43,0,43,6]]}
[{"$nulls":8},"Comments"]
[{"$nulls":9},"Derived values"]
["ISO 12217-2:2017  CALCULATION WORKSHEET No. 9                        WINDS TIFFNESS TEST",{"$nulls":8},"Input values"]
[{"$nulls":30},"list"]
[{"$f":"CONCATENATE(coverSheet!B5,\"          \",coverSheet!B12)","v":"          "},{"$nulls":29},"Yes",5,"C"]
[{"$nulls":30},"No",6,"D"]
[{"$nulls":6},"Design Categories C and D using option 5 or 6 only"]
[{"$nulls":30},"Experimental"]
["Method used:",{"$nulls":29},"Theoretical"]
[]
["Experimental method:",{"$nulls":11},"Table 7 — Required calculated wind speed"]
[]
["Item",null,"Symbol","Unit","Un-reefed","Reefed","Ref.",{"$nulls":5},"Wind speed in metres per second"]
["Boat prepared and weight positioned as in 6.8.2",null,null,"Yes / No",null,null,"6.8.2.1",{"$nulls":5},"Design category","C","D"]
["Final tension in pull-down line",null,"T","kg",null,null,"6.8.2.3",{"$nulls":5},"Option 5",13,8]
["Perpendicular lever between pull-down and mooring lines (see fig. 5)",null,"h","m",null,null,"6.8.2.3",{"$nulls":5},"Option 6",11,6]
["Final angle of heel observed",null,"ΦT","degree",null,null,"6.8.2.3"]
["Beam of hull",null,"BH","m",{"$f":"'Worksheet 2'!I12","v":{"v":0,"d":"0.00"}},null,"3.4.3"]
["Actual profile projected area of sails, including overlaps ",null,"A'S","m²",null,null,"3.4.9"]
["Lever from centre of sail area to underwater profile (see fig. 6)",null,"hCE + hLP","m",null,null,"6.8.2.4"]
["Calculated wind speed = ",null,"vW","m/s",{"$f":"SQRT((13*E16*E15+390*E18)/E19/E20/(COS(RADIANS(E17)))^1.3)","v":{"$error":"#DIV/0!"}},{"$f":"SQRT((13*E16*E15+390*E18)/F19/F20/(COS(RADIANS(E17)))^1.3)","v":{"$error":"#DIV/0!"}},"6.8.2.4"]
["Is reefed sail plan used?                                ",null,null,"Yes / No",null,null,"6.8.4.2"]
["Design Category given according to Table 7",{"$nulls":3},{"$f":"IF(E22=\"No\",IF(OR('Worksheet 1'!$D$8=\"A\",'Worksheet 1'!$D$8=\"B\"),\"n.a.\",IF('Worksheet 9'!E21>13,\"C\",IF(AND('Worksheet 2'!$E$49=6,'Worksheet 9'!E21>11),\"C\",IF('Worksheet 9'!E21>8,\"D\",IF(AND('Worksheet 9'!E21>6,'Worksheet 2'!$E$49=6),\"D\",\"Fail\"))))),\"\")","v":""},{"$f":"IF(E22=\"Yes\",IF(OR('Worksheet 1'!$D$8=\"A\",'Worksheet 1'!$D$8=\"B\"),\"n.a.\",IF('Worksheet 9'!F21>13,\"C\",IF(AND('Worksheet 2'!$E$49=6,'Worksheet 9'!F21>11),\"C\",IF('Worksheet 9'!F21>8,\"D\",IF(AND('Worksheet 9'!F21>6,'Worksheet 2'!$E$49=6),\"D\",\"Fail\"))))),\"\")","v":""},"Table 5",{"$nulls":19},{"$f":"IF(C9=\"Experimental\",IF(OR(E23=\"Fail\",F23=\"Fail\"),\"Fail\",\"Pass\"),IF(C9=\"\",\"\",IF(OR(E41=\"Fail\",F41=\"Fail\"),\"Fail\",\"Pass\")))","v":""},{"$nulls":24},"sAbfragetabelle"]
[]
[]
["NB: Safety signs in accordance with Figure 7 must be affixed to the boat."]
[]
["Alternative theoretical method:"]
[]
["Item",null,"Symbol","Unit","Un-reefed","Reefed","Ref."]
["Righting moment curve increased by one crew to windward",null,null,"Yes / No","Yes",null,"6.8.3.2"]
["Option (from worksheet 2) being used",{"$nulls":3},{"$f":"IF(OR('Worksheet 2'!E49<5,'Worksheet 2'!E49>6),\"n.a.\",'Worksheet 2'!E49)","v":"n.a."},null,"Table 2"]
["Design Category intended",{"$nulls":3},{"$f":"IF(OR('Worksheet 1'!D8=\"A\",'Worksheet 1'!D8=\"B\"),\"n.a.\",'Worksheet 1'!D8)","v":{"v":0,"d":"0.00"}},{"$f":"IF(OR('Worksheet 1'!D8=\"A\",'Worksheet 1'!D8=\"B\"),\"n.a.\",'Worksheet 1'!D8)","v":{"v":0,"d":"0.00"}}]
["Relevant calculation wind speed taken from Table 7",null,"vW","m/s",{"$f":"IF(AND(E32=5,E33=\"C\"),13,IF(AND(E32=6,E33=\"C\"),11,IF(AND(E32=6,E33=\"D\"),6,IF(AND(E32=5,E33=\"D\"),8,\"n.a.\"))))","v":"n.a."},{"$f":"IF(AND(E32=5,F33=\"C\"),13,IF(AND(E32=6,F33=\"C\"),11,IF(AND(E32=6,F33=\"D\"),6,IF(AND(E32=5,F33=\"D\"),8,\"n.a.\"))))","v":"n.a."},"Table 6"]
["Actual profile projected area of sails, including overlaps ",null,"A'S","m²",null,null,"3.4.9",null,{"$f":"IF(F35=\"\",\"\",IF(F35<2/3*E35,\"Reefed sail area must be min 2/3 of unreefed sail area\",\"\"))","v":""}]
["Upright lever from centre of sail area to underwater profile (see fig. 6)",null,"hCE + hLP","m",null,null,"6.8.2.4"]
["Calculated 0,75 vW2 A'S (h'CE hLP)",null,"MW0","Nm",{"$f":"0.75*E34^2*E35*E36","v":{"$error":"#VALUE!"}},{"$f":"0.75*F34^2*F35*F36","v":{"$error":"#VALUE!"}},"6.8.2.4"]
["From righting moment curve and wind heeling curve \n[= M W0 (cosΦ)1,3] resulting angle of heel =",null,"Φ","degree",{"$f":"IF('Worksheet 9a'!$B$10=\"unreefed\",'Worksheet 9a'!$B$66,\"\")","v":""},{"$f":"IF('Worksheet 9a'!$B$10=\"reefed\",'Worksheet 9a'!$B$66,\"\")","v":""},"6.8.3.4"]
["Is Φ < ΦD (see Worksheet 3) and < 45°?                                            ",null,null,"Yes / No",{"$f":"IF(E38=\"\",\"\",IF(AND(E38<'Worksheet 3'!$H$35,E38<45),\"Yes\",\"Fail\"))","v":""},{"$f":"IF(F38=\"\",\"\",IF(AND(F38<'Worksheet 3'!$H$35,F38<45),\"Yes\",\"Fail\"))","v":""}]
["Is reefed sail plan used?                                ",null,null,"Yes / No",{"$f":"IF('Worksheet 9a'!B10=\"reefed\",\"Yes\",IF('Worksheet 9a'!B10=\"\",\"\",\"No\"))","v":""},null,"6.8.4.2"]
["Design Category given according to Table 7",{"$nulls":3},{"$f":"IF(E39=\"yes\",E33,IF(E40=\"Yes\",\"Check reefed sails\",\"Fail\"))","v":"Fail"},{"$f":"IF(E40=\"no\",\"\",IF(F39=\"Yes\",F33,\"Fail\"))","v":"Fail"},"Table 5"]
[]
[]
["NB: Safety signs in accordance with Figure 7 must be affixed to the boat."]

{"sheet":"Worksheet 9a","index":15,"n_rows":112,"n_cols":64,"rows_kept":112,"merged":[[0,13,0,14],[1,0,1,7],[3,0,3,7]]}
[{"$nulls":13},"Comments"]
["ISO 12217-2:2017   CALCULATION WORKSHEET No. 9a                     curve of righting moment vs. wind heeling curve",{"$nulls":13},"Derived values"]
[{"$nulls":14},"Input values",{"$nulls":32},"list:"]
[{"$f":"CONCATENATE(coverSheet!B5,\"          \",coverSheet!B12)","v":"          "}]
[{"$nulls":47},"wind heeling moment curve"]
["insert curve of righting moment in 5° steps in one of following units:",{"$nulls":46},"unreefed"]
[null,"N m","kg m","m",{"$nulls":43},"reefed"]
[]
[null,null,"chosen unit"]
[null,null,"chose if reefed or unreefed sail combination used"]
["heeling angle[°]","insert righting \nArm   / Moment \n[Nm, kg m, m]","Righting Moment\n[Nm]","Righting Moment \n[kg m]","Righting Arm Gz \n[m]","Diff(B-A/5)","Wind Heeling moment curve\n [N m]","Righting moment curve increased by one crew windward",{"$nulls":45},"Righting Moment [Nm]","Wind Heeling Moment curve\n [N m]","check",null,null,"calc",null,"nachkomma","Righting Moment [Nm]","Wind Heeling Moment curve\n [N m]","check"]
[0,null,{"$f":"D12*9.806","v":{"$error":"#VALUE!"}},{"$f":"E12*'Worksheet 1'!$AA$16","v":{"$error":"#VALUE!"}},{"$f":"IF($B$9=\"N m\",B12/9.806/'Worksheet 1'!$AA$16,IF($B$9=\"kg m\",B12/'Worksheet 1'!$AA$16,IF($B$9=\"m\",B12,\"error\")))","v":"error"},{"$f":"(E17-E12)/5","v":{"$error":"#VALUE!"}},{"$f":"IF($B$10=\"unreefed\",'Worksheet 9'!$E$37*(COS(RADIANS('Worksheet 9a'!A12))^1.3),IF('Worksheet 9a'!$B$10=\"reefed\",'Worksheet 9'!$F$37*(COS(RADIANS('Worksheet 9a'!A12))^1.3),\"error\"))","v":"error"},{"$f":"C12+294*'Worksheet 2'!$I$12*COS(RADIANS('Worksheet 9a'!A12))","v":{"$error":"#VALUE!"}},{"$nulls":44},0,{"$f":"H12","v":{"$error":"#VALUE!"}},{"$f":"G12","v":"error"},{"$f":"IF(AND(BB11<BC11,BB12>BC12),1,\"\")","v":{"$error":"#VALUE!"}},null,null,"Vorkomma",null,{"$f":"BG13","v":{"$error":"#N/A"}},{"$f":"BG19","v":{"$error":"#N/A"}},{"$f":"BG25","v":{"$error":"#N/A"}},{"$f":"IF(AND(BJ11<BK11,BJ12>BK12),1,\"\")","v":{"$error":"#N/A"}}]
[1,null,{"$error":"#VALUE!"},{"$f":"E13*'Worksheet 1'!$AA$16","v":{"$error":"#VALUE!"}},{"$f":"E12+F12","v":{"$error":"#VALUE!"}},null,{"$f":"IF($B$10=\"unreefed\",'Worksheet 9'!$E$37*(COS(RADIANS('Worksheet 9a'!A13))^1.3),IF('Worksheet 9a'!$B$10=\"reefed\",'Worksheet 9'!$F$37*(COS(RADIANS('Worksheet 9a'!A13))^1.3),\"error\"))","v":"error"},{"$f":"C13+294*'Worksheet 2'!$I$12*COS(RADIANS('Worksheet 9a'!A13))","v":{"$error":"#VALUE!"}},{"$nulls":44},1,{"$f":"H13","v":{"$error":"#VALUE!"}},{"$f":"G13","v":"error"},{"$f":"IF(AND(BB12<BC12,BB13>BC13),1,\"\")","v":{"$error":"#VALUE!"}},null,null,{"$f":"LOOKUP(1,BD12:BD62,BA12:BA62-1)","v":{"$error":"#N/A"}},null,{"$f":"BI12+0.01","v":{"$error":"#N/A"}},{"$f":"BJ12+$BG$23","v":{"$error":"#N/A"}},{"$f":"BK12+$BG$29","v":{"$error":"#N/A"}},{"$f":"IF(AND(BJ12<BK12,BJ13>BK13),1,\"\")","v":{"$error":"#N/A"}}]
[2,null,{"$error":"#VALUE!"},{"$f":"E14*'Worksheet 1'!$AA$16","v":{"$error":"#VALUE!"}},{"$f":"E13+F12","v":{"$error":"#VALUE!"}},null,{"$f":"IF($B$10=\"unreefed\",'Worksheet 9'!$E$37*(COS(RADIANS('Worksheet 9a'!A14))^1.3),IF('Worksheet 9a'!$B$10=\"reefed\",'Worksheet 9'!$F$37*(COS(RADIANS('Worksheet 9a'!A14))^1.3),\"error\"))","v":"error"},{"$f":"C14+294*'Worksheet 2'!$I$12*COS(RADIANS('Worksheet 9a'!A14))","v":{"$error":"#VALUE!"}},{"$nulls":44},2,{"$error":"#VALUE!"},"error",{"$error":"#VALUE!"},null,null,"Genau",null,{"$f":"BI13+0.01","v":{"$error":"#N/A"}},{"$f":"BJ13+$BG$23","v":{"$error":"#N/A"}},{"$f":"BK13+$BG$29","v":{"$error":"#N/A"}},{"$error":"#N/A"}]
[3,null,{"$error":"#VALUE!"},{"$f":"E15*'Worksheet 1'!$AA$16","v":{"$error":"#VALUE!"}},{"$f":"E14+F12","v":{"$error":"#VALUE!"}},null,{"$f":"IF($B$10=\"unreefed\",'Worksheet 9'!$E$37*(COS(RADIANS('Worksheet 9a'!A15))^1.3),IF('Worksheet 9a'!$B$10=\"reefed\",'Worksheet 9'!$F$37*(COS(RADIANS('Worksheet 9a'!A15))^1.3),\"error\"))","v":"error"},{"$f":"C15+294*'Worksheet 2'!$I$12*COS(RADIANS('Worksheet 9a'!A15))","v":{"$error":"#VALUE!"}},{"$nulls":44},3,{"$error":"#VALUE!"},"error",{"$error":"#VALUE!"},null,null,{"$f":"IF(B12=\"\",\"\",LOOKUP(1,BL12:BL112,BI12:BI112))","v":""},null,{"$error":"#N/A"},{"$error":"#N/A"},{"$error":"#N/A"},{"$error":"#N/A"}]
[4,null,{"$error":"#VALUE!"},{"$f":"E16*'Worksheet 1'!$AA$16","v":{"$error":"#VALUE!"}},{"$f":"E15+F12","v":{"$error":"#VALUE!"}},null,{"$f":"IF($B$10=\"unreefed\",'Worksheet 9'!$E$37*(COS(RADIANS('Worksheet 9a'!A16))^1.3),IF('Worksheet 9a'!$B$10=\"reefed\",'Worksheet 9'!$F$37*(COS(RADIANS('Worksheet 9a'!A16))^1.3),\"error\"))","v":"error"},{"$f":"C16+294*'Worksheet 2'!$I$12*COS(RADIANS('Worksheet 9a'!A16))","v":{"$error":"#VALUE!"}},{"$nulls":44},4,{"$error":"#VALUE!"},"error",{"$error":"#VALUE!"},{"$nulls":4},{"$error":"#N/A"},{"$error":"#N/A"},{"$error":"#N/A"},{"$error":"#N/A"}]
[5,null,{"$error":"#VALUE!"},{"$f":"E17*'Worksheet 1'!$AA$16","v":{"$error":"#VALUE!"}},{"$f":"IF($B$9=\"N m\",B17/9.806/'Worksheet 1'!$AA$16,IF($B$9=\"kg m\",B17/'Worksheet 1'!$AA$16,IF($B$9=\"m\",B17,\"error\")))","v":"error"},{"$f":"(E22-E17)/5","v":{"$error":"#VALUE!"}},{"$f":"IF($B$10=\"unreefed\",'Worksheet 9'!$E$37*(COS(RADIANS('Worksheet 9a'!A17))^1.3),IF('Worksheet 9a'!$B$10=\"reefed\",'Worksheet 9'!$F$37*(COS(RADIANS('Worksheet 9a'!A17))^1.3),\"error\"))","v":"error"},{"$f":"C17+294*'Worksheet 2'!$I$12*COS(RADIANS('Worksheet 9a'!A17))","v":{"$error":"#VALUE!"}},{"$nulls":44},5,{"$error":"#VALUE!"},"error",{"$error":"#VALUE!"},{"$nulls":4},{"$error":"#N/A"},{"$error":"#N/A"},{"$error":"#N/A"},{"$error":"#N/A"}]
[6,null,{"$error":"#VALUE!"},{"$f":"E18*'Worksheet 1'!$AA$16","v":{"$error":"#VALUE!"}},{"$f":"E17+F17","v":{"$error":"#VALUE!"}},null,{"$f":"IF($B$10=\"unreefed\",'Worksheet 9'!$E$37*(COS(RADIANS('Worksheet 9a'!A18))^1.3),IF('Worksheet 9a'!$B$10=\"reefed\",'Worksheet 9'!$F$37*(COS(RADIANS('Worksheet 9a'!A18))^1.3),\"error\"))","v":"error"},{"$f":"C18+294*'Worksheet 2'!$I$12*COS(RADIANS('Worksheet 9a'!A18))","v":{"$error":"#VALUE!"}},{"$nulls":44},6,{"$error":"#VALUE!"},"error",{"$error":"#VALUE!"},null,null,"Nachbestimmung",null,{"$error":"#N/A"},{"$error":"#N/A"},{"$error":"#N/A"},{"$error":"#N/A"}]
[7,null,{"$error":"#VALUE!"},{"$f":"E19*'Worksheet 1'!$AA$16","v":{"$error":"#VALUE!"}},{"$f":"E18+F17","v":{"$error":"#VALUE!"}},null,{"$f":"IF($B$10=\"unreefed\",'Worksheet 9'!$E$37*(COS(RADIANS('Worksheet 9a'!A19))^1.3),IF('Worksheet 9a'!$B$10=\"reefed\",'Worksheet 9'!$F$37*(COS(RADIANS('Worksheet 9a'!A19))^1.3),\"error\"))","v":"error"},{"$f":"C19+294*'Worksheet 2'!$I$12*COS(RADIANS('Worksheet 9a'!A19))","v":{"$error":"#VALUE!"}},{"$nulls":44},7,{"$error":"#VALUE!"},"error",{"$error":"#VALUE!"},null,"Righting",{"$f":"LOOKUP(BG13,BA12:BA62,BB12:BB62)","v":{"$error":"#N/A"}},"untere ",{"$error":"#N/A"},{"$error":"#N/A"},{"$error":"#N/A"},{"$error":"#N/A"}]
[8,null,{"$error":"#VALUE!"},{"$f":"E20*'Worksheet 1'!$AA$16","v":{"$error":"#VALUE!"}},{"$f":"E19+F17","v":{"$error":"#VALUE!"}},null,{"$f":"IF($B$10=\"unreefed\",'Worksheet 9'!$E$37*(COS(RADIANS('Worksheet 9a'!A20))^1.3),IF('Worksheet 9a'!$B$10=\"reefed\",'Worksheet 9'!$F$37*(COS(RADIANS('Worksheet 9a'!A20))^1.3),\"error\"))","v":"error"},{"$f":"C20+294*'Worksheet 2'!$I$12*COS(RADIANS('Worksheet 9a'!A20))","v":{"$error":"#VALUE!"}},{"$nulls":44},8,{"$error":"#VALUE!"},"error",{"$error":"#VALUE!"},null,"Moment",{"$f":"LOOKUP(BG13+1,BA12:BA62,BB12:BB62)","v":{"$error":"#N/A"}},"obere",{"$error":"#N/A"},{"$error":"#N/A"},{"$error":"#N/A"},{"$error":"#N/A"}]
[9,null,{"$error":"#VALUE!"},{"$f":"E21*'Worksheet 1'!$AA$16","v":{"$error":"#VALUE!"}},{"$f":"E20+F17","v":{"$error":"#VALUE!"}},null,{"$f":"IF($B$10=\"unreefed\",'Worksheet 9'!$E$37*(COS(RADIANS('Worksheet 9a'!A21))^1.3),IF('Worksheet 9a'!$B$10=\"reefed\",'Worksheet 9'!$F$37*(COS(RADIANS('Worksheet 9a'!A21))^1.3),\"error\"))","v":"error"},{"$f":"C21+294*'Worksheet 2'!$I$12*COS(RADIANS('Worksheet 9a'!A21))","v":{"$error":"#VALUE!"}},{"$nulls":44},9,{"$error":"#VALUE!"},"error",{"$error":"#VALUE!"},{"$nulls":4},{"$error":"#N/A"},{"$error":"#N/A"},{"$error":"#N/A"},{"$error":"#N/A"}]
[10,null,{"$error":"#VALUE!"},{"$f":"E22*'Worksheet 1'!$AA$16","v":{"$error":"#VALUE!"}},{"$f":"IF($B$9=\"N m\",B22/9.806/'Worksheet 1'!$AA$16,IF($B$9=\"kg m\",B22/'Worksheet 1'!$AA$16,IF($B$9=\"m\",B22,\"error\")))","v":"error"},{"$f":"(E27-E22)/5","v":{"$error":"#VALUE!"}},{"$f":"IF($B$10=\"unreefed\",'Worksheet 9'!$E$37*(COS(RADIANS('Worksheet 9a'!A22))^1.3),IF('Worksheet 9a'!$B$10=\"reefed\",'Worksheet 9'!$F$37*(COS(RADIANS('Worksheet 9a'!A22))^1.3),\"error\"))","v":"error"},{"$f":"C22+294*'Worksheet 2'!$I$12*COS(RADIANS('Worksheet 9a'!A22))","v":{"$error":"#VALUE!"}},{"$nulls":5},"Please insert unit of righting moment curve in B9!",{"$nulls":38},10,{"$error":"#VALUE!"},"error",{"$error":"#VALUE!"},null,null,{"$f":"BG20-BG19","v":{"$error":"#N/A"}},null,{"$error":"#N/A"},{"$error":"#N/A"},{"$error":"#N/A"},{"$error":"#N/A"}]
[11,null,{"$error":"#VALUE!"},{"$f":"E23*'Worksheet 1'!$AA$16","v":{"$error":"#VALUE!"}},{"$f":"E22+F22","v":{"$error":"#VALUE!"}},null,{"$f":"IF($B$10=\"unreefed\",'Worksheet 9'!$E$37*(COS(RADIANS('Worksheet 9a'!A23))^1.3),IF('Worksheet 9a'!$B$10=\"reefed\",'Worksheet 9'!$F$37*(COS(RADIANS('Worksheet 9a'!A23))^1.3),\"error\"))","v":"error"},{"$f":"C23+294*'Worksheet 2'!$I$12*COS(RADIANS('Worksheet 9a'!A23))","v":{"$error":"#VALUE!"}},{"$nulls":44},11,{"$error":"#VALUE!"},"error",{"$error":"#VALUE!"},null,null,{"$f":"BG22/100","v":{"$error":"#N/A"}},null,{"$error":"#N/A"},{"$error":"#N/A"},{"$error":"#N/A"},{"$error":"#N/A"}]
[12,null,{"$error":"#VALUE!"},{"$f":"E24*'Worksheet 1'!$AA$16","v":{"$error":"#VALUE!"}},{"$f":"E23+F22","v":{"$error":"#VALUE!"}},null,{"$f":"IF($B$10=\"unreefed\",'Worksheet 9'!$E$37*(COS(RADIANS('Worksheet 9a'!A24))^1.3),IF('Worksheet 9a'!$B$10=\"reefed\",'Worksheet 9'!$F$37*(COS(RADIANS('Worksheet 9a'!A24))^1.3),\"error\"))","v":"error"},{"$f":"C24+294*'Worksheet 2'!$I$12*COS(RADIANS('Worksheet 9a'!A24))","v":{"$error":"#VALUE!"}},{"$nulls":44},12,{"$error":"#VALUE!"},"error",{"$error":"#VALUE!"},{"$nulls":4},{"$error":"#N/A"},{"$error":"#N/A"},{"$error":"#N/A"},{"$error":"#N/A"}]
[13,null,{"$error":"#VALUE!"},{"$f":"E25*'Worksheet 1'!$AA$16","v":{"$error":"#VALUE!"}},{"$f":"E24+F22","v":{"$error":"#VALUE!"}},null,{"$f":"IF($B$10=\"unreefed\",'Worksheet 9'!$E$37*(COS(RADIANS('Worksheet 9a'!A25))^1.3),IF('Worksheet 9a'!$B$10=\"reefed\",'Worksheet 9'!$F$37*(COS(RADIANS('Worksheet 9a'!A25))^1.3),\"error\"))","v":"error"},{"$f":"C25+294*'Worksheet 2'!$I$12*COS(RADIANS('Worksheet 9a'!A25))","v":{"$error":"#VALUE!"}},{"$nulls":44},13,{"$error":"#VALUE!"},"error",{"$error":"#VALUE!"},null,"Crew",{"$f":"LOOKUP(BG13,BA12:BA62,BC12:BC62)","v":{"$error":"#N/A"}},"untere ",{"$error":"#N/A"},{"$error":"#N/A"},{"$error":"#N/A"},{"$error":"#N/A"}]
[14,null,{"$error":"#VALUE!"},{"$f":"E26*'Worksheet 1'!$AA$16","v":{"$error":"#VALUE!"}},{"$f":"E25+F22","v":{"$error":"#VALUE!"}},null,{"$f":"IF($B$10=\"unreefed\",'Worksheet 9'!$E$37*(COS(RADIANS('Worksheet 9a'!A26))^1.3),IF('Worksheet 9a'!$B$10=\"reefed\",'Worksheet 9'!$F$37*(COS(RADIANS('Worksheet 9a'!A26))^1.3),\"error\"))","v":"error"},{"$f":"C26+294*'Worksheet 2'!$I$12*COS(RADIANS('Worksheet 9a'!A26))","v":{"$error":"#VALUE!"}},{"$nulls":44},14,{"$error":"#VALUE!"},"error",{"$error":"#VALUE!"},null,"Moment",{"$f":"LOOKUP(BG13+1,BA12:BA62,BC12:BC62)","v":{"$error":"#N/A"}},"obere",{"$error":"#N/A"},{"$error":"#N/A"},{"$error":"#N/A"},{"$error":"#N/A"}]
[15,null,{"$error":"#VALUE!"},{"$f":"E27*'Worksheet 1'!$AA$16","v":{"$error":"#VALUE!"}},{"$f":"IF($B$9=\"N m\",B27/9.806/'Worksheet 1'!$AA$16,IF($B$9=\"kg m\",B27/'Worksheet 1'!$AA$16,IF($B$9=\"m\",B27,\"error\")))","v":"error"},{"$f":"(E32-E27)/5","v":{"$error":"#VALUE!"}},{"$f":"IF($B$10=\"unreefed\",'Worksheet 9'!$E$37*(COS(RADIANS('Worksheet 9a'!A27))^1.3),IF('Worksheet 9a'!$B$10=\"reefed\",'Worksheet 9'!$F$37*(COS(RADIANS('Worksheet 9a'!A27))^1.3),\"error\"))","v":"error"},{"$f":"C27+294*'Worksheet 2'!$I$12*COS(RADIANS('Worksheet 9a'!A27))","v":{"$error":"#VALUE!"}},{"$nulls":44},15,{"$error":"#VALUE!"},"error",{"$error":"#VALUE!"},{"$nulls":4},{"$error":"#N/A"},{"$error":"#N/A"},{"$error":"#N/A"},{"$error":"#N/A"}]
[16,null,{"$error":"#VALUE!"},{"$f":"E28*'Worksheet 1'!$AA$16","v":{"$error":"#VALUE!"}},{"$f":"E27+F27","v":{"$error":"#VALUE!"}},null,{"$f":"IF($B$10=\"unreefed\",'Worksheet 9'!$E$37*(COS(RADIANS('Worksheet 9a'!A28))^1.3),IF('Worksheet 9a'!$B$10=\"reefed\",'Worksheet 9'!$F$37*(COS(RADIANS('Worksheet 9a'!A28))^1.3),\"error\"))","v":"error"},{"$f":"C28+294*'Worksheet 2'!$I$12*COS(RADIANS('Worksheet 9a'!A28))","v":{"$error":"#VALUE!"}},{"$nulls":44},16,{"$error":"#VALUE!"},"error",{"$error":"#VALUE!"},null,null,{"$f":"BG26-BG25","v":{"$error":"#N/A"}},null,{"$error":"#N/A"},{"$error":"#N/A"},{"$error":"#N/A"},{"$error":"#N/A"}]
[17,null,{"$error":"#VALUE!"},{"$f":"E29*'Worksheet 1'!$AA$16","v":{"$error":"#VALUE!"}},{"$f":"E28+F27","v":{"$error":"#VALUE!"}},null,{"$f":"IF($B$10=\"unreefed\",'Worksheet 9'!$E$37*(COS(RADIANS('Worksheet 9a'!A29))^1.3),IF('Worksheet 9a'!$B$10=\"reefed\",'Worksheet 9'!$F$37*(COS(RADIANS('Worksheet 9a'!A29))^1.3),\"error\"))","v":"error"},{"$f":"C29+294*'Worksheet 2'!$I$12*COS(RADIANS('Worksheet 9a'!A29))","v":{"$error":"#VALUE!"}},{"$nulls":44},17,{"$error":"#VALUE!"},"error",{"$error":"#VALUE!"},null,null,{"$f":"BG28/100","v":{"$error":"#N/A"}},null,{"$error":"#N/A"},{"$error":"#N/A"},{"$error":"#N/A"},{"$error":"#N/A"}]
[18,null,{"$error":"#VALUE!"},{"$f":"E30*'Worksheet 1'!$AA$16","v":{"$error":"#VALUE!"}},{"$f":"E29+F27","v":{"$error":"#VALUE!"}},null,{"$f":"IF($B$10=\"unreefed\",'Worksheet 9'!$E$37*(COS(RADIANS('Worksheet 9a'!A30))^1.3),IF('Worksheet 9a'!$B$10=\"reefed\",'Worksheet 9'!$F$37*(COS(RADIANS('Worksheet 9a'!A30))^1.3),\"error\"))","v":"error"},{"$f":"C30+294*'Worksheet 2'!$I$12*COS(RADIANS('Worksheet 9a'!A30))","v":{"$error":"#VALUE!"}},{"$nulls":44},18,{"$error":"#VALUE!"},"error",{"$error":"#VALUE!"},{"$nulls":4},{"$error":"#N/A"},{"$error":"#N/A"},{"$error":"#N/A"},{"$error":"#N/A"}]
[19,null,{"$error":"#VALUE!"},{"$f":"E31*'Worksheet 1'!$AA$16","v":{"$error":"#VALUE!"}},{"$f":"E30+F27","v":{"$error":"#VALUE!"}},null,{"$f":"IF($B$10=\"unreefed\",'Worksheet 9'!$E$37*(COS(RADIANS('Worksheet 9a'!A31))^1.3),IF('Worksheet 9a'!$B$10=\"reefed\",'Worksheet 9'!$F$37*(COS(RADIANS('Worksheet 9a'!A31))^1.3),\"error\"))","v":"error"},{"$f":"C31+294*'Worksheet 2'!$I$12*COS(RADIANS('Worksheet 9a'!A31))","v":{"$error":"#VALUE!"}},{"$nulls":44},19,{"$error":"#VALUE!"},"error",{"$error":"#VALUE!"},{"$nulls":4},{"$error":"#N/A"},{"$error":"#N/A"},{"$error":"#N/A"},{"$error":"#N/A"}]
[20,null,{"$error":"#VALUE!"},{"$f":"E32*'Worksheet 1'!$AA$16","v":{"$error":"#VALUE!"}},{"$f":"IF($B$9=\"N m\",B32/9.806/'Worksheet 1'!$AA$16,IF($B$9=\"kg m\",B32/'Worksheet 1'!$AA$16,IF($B$9=\"m\",B32,\"error\")))","v":"error"},{"$f":"(E37-E32)/5","v":{"$error":"#VALUE!"}},{"$f":"IF($B$10=\"unreefed\",'Worksheet 9'!$E$37*(COS(RADIANS('Worksheet 9a'!A32))^1.3),IF('Worksheet 9a'!$B$10=\"reefed\",'Worksheet 9'!$F$37*(COS(RADIANS('Worksheet 9a'!A32))^1.3),\"error\"))","v":"error"},{"$f":"C32+294*'Worksheet 2'!$I$12*COS(RADIANS('Worksheet 9a'!A32))","v":{"$error":"#VALUE!"}},{"$nulls":44},20,{"$error":"#VALUE!"},"error",{"$f":"IF(AND(BB31<BC31,BB32>BC32),1,\"\")","v":{"$error":"#VALUE!"}},{"$nulls":4},{"$error":"#N/A"},{"$error":"#N/A"},{"$error":"#N/A"},{"$error":"#N/A"}]
[21,null,{"$error":"#VALUE!"},{"$f":"E33*'Worksheet 1'!$AA$16","v":{"$error":"#VALUE!"}},{"$f":"E32+F32","v":{"$error":"#VALUE!"}},null,{"$f":"IF($B$10=\"unreefed\",'Worksheet 9'!$E$37*(COS(RADIANS('Worksheet 9a'!A33))^1.3),IF('Worksheet 9a'!$B$10=\"reefed\",'Worksheet 9'!$F$37*(COS(RADIANS('Worksheet 9a'!A33))^1.3),\"error\"))","v":"error"},{"$f":"C33+294*'Worksheet 2'!$I$12*COS(RADIANS('Worksheet 9a'!A33))","v":{"$error":"#VALUE!"}},{"$nulls":44},21,{"$error":"#VALUE!"},"error",{"$error":"#VALUE!"},{"$nulls":4},{"$error":"#N/A"},{"$error":"#N/A"},{"$error":"#N/A"},{"$error":"#N/A"}]
[22,null,{"$error":"#VALUE!"},{"$f":"E34*'Worksheet 1'!$AA$16","v":{"$error":"#VALUE!"}},{"$f":"E33+F32","v":{"$error":"#VALUE!"}},null,{"$f":"IF($B$10=\"unreefed\",'Worksheet 9'!$E$37*(COS(RADIANS('Worksheet 9a'!A34))^1.3),IF('Worksheet 9a'!$B$10=\"reefed\",'Worksheet 9'!$F$37*(COS(RADIANS('Worksheet 9a'!A34))^1.3),\"error\"))","v":"error"},{"$f":"C34+294*'Worksheet 2'!$I$12*COS(RADIANS('Worksheet 9a'!A34))","v":{"$error":"#VALUE!"}},{"$nulls":44},22,{"$error":"#VALUE!"},"error",{"$error":"#VALUE!"},{"$nulls":4},{"$error":"#N/A"},{"$error":"#N/A"},{"$error":"#N/A"},{"$error":"#N/A"}]
[23,null,{"$error":"#VALUE!"},{"$f":"E35*'Worksheet 1'!$AA$16","v":{"$error":"#VALUE!"}},{"$f":"E34+F32","v":{"$error":"#VALUE!"}},null,{"$f":"IF($B$10=\"unreefed\",'Worksheet 9'!$E$37*(COS(RADIANS('Worksheet 9a'!A35))^1.3),IF('Worksheet 9a'!$B$10=\"reefed\",'Worksheet 9'!$F$37*(COS(RADIANS('Worksheet 9a'!A35))^1.3),\"error\"))","v":"error"},{"$f":"C35+294*'Worksheet 2'!$I$12*COS(RADIANS('Worksheet 9a'!A35))","v":{"$error":"#VALUE!"}},{"$nulls":44},23,{"$error":"#VALUE!"},"error",{"$error":"#VALUE!"},{"$nulls":4},{"$error":"#N/A"},{"$error":"#N/A"},{"$error":"#N/A"},{"$error":"#N/A"}]
[24,null,{"$error":"#VALUE!"},{"$f":"E36*'Worksheet 1'!$AA$16","v":{"$error":"#VALUE!"}},{"$f":"E35+F32","v":{"$error":"#VALUE!"}},null,{"$f":"IF($B$10=\"unreefed\",'Worksheet 9'!$E$37*(COS(RADIANS('Worksheet 9a'!A36))^1.3),IF('Worksheet 9a'!$B$10=\"reefed\",'Worksheet 9'!$F$37*(COS(RADIANS('Worksheet 9a'!A36))^1.3),\"error\"))","v":"error"},{"$f":"C36+294*'Worksheet 2'!$I$12*COS(RADIANS('Worksheet 9a'!A36))","v":{"$error":"#VALUE!"}},{"$nulls":44},24,{"$error":"#VALUE!"},"error",{"$error":"#VALUE!"},{"$nulls":4},{"$error":"#N/A"},{"$error":"#N/A"},{"$error":"#N/A"},{"$error":"#N/A"}]
[25,null,{"$error":"#VALUE!"},{"$f":"E37*'Worksheet 1'!$AA$16","v":{"$error":"#VALUE!"}},{"$f":"IF($B$9=\"N m\",B37/9.806/'Worksheet 1'!$AA$16,IF($B$9=\"kg m\",B37/'Worksheet 1'!$AA$16,IF($B$9=\"m\",B37,\"error\")))","v":"error"},{"$f":"(E42-E37)/5","v":{"$error":"#VALUE!"}},{"$f":"IF($B$10=\"unreefed\",'Worksheet 9'!$E$37*(COS(RADIANS('Worksheet 9a'!A37))^1.3),IF('Worksheet 9a'!$B$10=\"reefed\",'Worksheet 9'!$F$37*(COS(RADIANS('Worksheet 9a'!A37))^1.3),\"error\"))","v":"error"},{"$f":"C37+294*'Worksheet 2'!$I$12*COS(RADIANS('Worksheet 9a'!A37))","v":{"$error":"#VALUE!"}},{"$nulls":44},25,{"$error":"#VALUE!"},"error",{"$error":"#VALUE!"},{"$nulls":4},{"$error":"#N/A"},{"$error":"#N/A"},{"$error":"#N/A"},{"$error":"#N/A"}]
[26,null,{"$error":"#VALUE!"},{"$f":"E38*'Worksheet 1'!$AA$16","v":{"$error":"#VALUE!"}},{"$f":"E37+F37","v":{"$error":"#VALUE!"}},null,{"$f":"IF($B$10=\"unreefed\",'Worksheet 9'!$E$37*(COS(RADIANS('Worksheet 9a'!A38))^1.3),IF('Worksheet 9a'!$B$10=\"reefed\",'Worksheet 9'!$F$37*(COS(RADIANS('Worksheet 9a'!A38))^1.3),\"error\"))","v":"error"},{"$f":"C38+294*'Worksheet 2'!$I$12*COS(RADIANS('Worksheet 9a'!A38))","v":{"$error":"#VALUE!"}},{"$nulls":44},26,{"$error":"#VALUE!"},"error",{"$error":"#VALUE!"},{"$nulls":4},{"$error":"#N/A"},{"$error":"#N/A"},{"$error":"#N/A"},{"$error":"#N/A"}]
[27,null,{"$error":"#VALUE!"},{"$f":"E39*'Worksheet 1'!$AA$16","v":{"$error":"#VALUE!"}},{"$f":"E38+F37","v":{"$error":"#VALUE!"}},null,{"$f":"IF($B$10=\"unreefed\",'Worksheet 9'!$E$37*(COS(RADIANS('Worksheet 9a'!A39))^1.3),IF('Worksheet 9a'!$B$10=\"reefed\",'Worksheet 9'!$F$37*(COS(RADIANS('Worksheet 9a'!A39))^1.3),\"error\"))","v":"error"},{"$f":"C39+294*'Worksheet 2'!$I$12*COS(RADIANS('Worksheet 9a'!A39))","v":{"$error":"#VALUE!"}},{"$nulls":44},27,{"$error":"#VALUE!"},"error",{"$error":"#VALUE!"},{"$nulls":4},{"$error":"#N/A"},{"$error":"#N/A"},{"$error":"#N/A"},{"$error":"#N/A"}]
[28,null,{"$error":"#VALUE!"},{"$f":"E40*'Worksheet 1'!$AA$16","v":{"$error":"#VALUE!"}},{"$f":"E39+F37","v":{"$error":"#VALUE!"}},null,{"$f":"IF($B$10=\"unreefed\",'Worksheet 9'!$E$37*(COS(RADIANS('Worksheet 9a'!A40))^1.3),IF('Worksheet 9a'!$B$10=\"reefed\",'Worksheet 9'!$F$37*(COS(RADIANS('Worksheet 9a'!A40))^1.3),\"error\"))","v":"error"},{"$f":"C40+294*'Worksheet 2'!$I$12*COS(RADIANS('Worksheet 9a'!A40))","v":{"$error":"#VALUE!"}},{"$nulls":44},28,{"$error":"#VALUE!"},"error",{"$error":"#VALUE!"},{"$nulls":4},{"$error":"#N/A"},{"$error":"#N/A"},{"$error":"#N/A"},{"$error":"#N/A"}]
[29,null,{"$error":"#VALUE!"},{"$f":"E41*'Worksheet 1'!$AA$16","v":{"$error":"#VALUE!"}},{"$f":"E40+F37","v":{"$error":"#VALUE!"}},null,{"$f":"IF($B$10=\"unreefed\",'Worksheet 9'!$E$37*(COS(RADIANS('Worksheet 9a'!A41))^1.3),IF('Worksheet 9a'!$B$10=\"reefed\",'Worksheet 9'!$F$37*(COS(RADIANS('Worksheet 9a'!A41))^1.3),\"error\"))","v":"error"},{"$f":"C41+294*'Worksheet 2'!$I$12*COS(RADIANS('Worksheet 9a'!A41))","v":{"$error":"#VALUE!"}},{"$nulls":44},29,{"$error":"#VALUE!"},"error",{"$error":"#VALUE!"},{"$nulls":4},{"$error":"#N/A"},{"$error":"#N/A"},{"$error":"#N/A"},{"$error":"#N/A"}]
[30,null,{"$error":"#VALUE!"},{"$f":"E42*'Worksheet 1'!$AA$16","v":{"$error":"#VALUE!"}},{"$f":"IF($B$9=\"N m\",B42/9.806/'Worksheet 1'!$AA$16,IF($B$9=\"kg m\",B42/'Worksheet 1'!$AA$16,IF($B$9=\"m\",B42,\"error\")))","v":"error"},{"$f":"(E47-E42)/5","v":{"$error":"#VALUE!"}},{"$f":"IF($B$10=\"unreefed\",'Worksheet 9'!$E$37*(COS(RADIANS('Worksheet 9a'!A42))^1.3),IF('Worksheet 9a'!$B$10=\"reefed\",'Worksheet 9'!$F$37*(COS(RADIANS('Worksheet 9a'!A42))^1.3),\"error\"))","v":"error"},{"$f":"C42+294*'Worksheet 2'!$I$12*COS(RADIANS('Worksheet 9a'!A42))","v":{"$error":"#VALUE!"}},{"$nulls":44},30,{"$error":"#VALUE!"},"error",{"$error":"#VALUE!"},{"$nulls":4},{"$error":"#N/A"},{"$error":"#N/A"},{"$error":"#N/A"},{"$error":"#N/A"}]
[31,null,{"$error":"#VALUE!"},{"$f":"E43*'Worksheet 1'!$AA$16","v":{"$error":"#VALUE!"}},{"$f":"E42+F42","v":{"$error":"#VALUE!"}},null,{"$f":"IF($B$10=\"unreefed\",'Worksheet 9'!$E$37*(COS(RADIANS('Worksheet 9a'!A43))^1.3),IF('Worksheet 9a'!$B$10=\"reefed\",'Worksheet 9'!$F$37*(COS(RADIANS('Worksheet 9a'!A43))^1.3),\"error\"))","v":"error"},{"$f":"C43+294*'Worksheet 2'!$I$12*COS(RADIANS('Worksheet 9a'!A43))","v":{"$error":"#VALUE!"}},{"$nulls":44},31,{"$error":"#VALUE!"},"error",{"$error":"#VALUE!"},{"$nulls":4},{"$error":"#N/A"},{"$error":"#N/A"},{"$error":"#N/A"},{"$error":"#N/A"}]
[32,null,{"$error":"#VALUE!"},{"$f":"E44*'Worksheet 1'!$AA$16","v":{"$error":"#VALUE!"}},{"$f":"E43+F42","v":{"$error":"#VALUE!"}},null,{"$f":"IF($B$10=\"unreefed\",'Worksheet 9'!$E$37*(COS(RADIANS('Worksheet 9a'!A44))^1.3),IF('Worksheet 9a'!$B$10=\"reefed\",'Worksheet 9'!$F$37*(COS(RADIANS('Worksheet 9a'!A44))^1.3),\"error\"))","v":"error"},{"$f":"C44+294*'Worksheet 2'!$I$12*COS(RADIANS('Worksheet 9a'!A44))","v":{"$error":"#VALUE!"}},{"$nulls":44},32,{"$error":"#VALUE!"},"error",{"$error":"#VALUE!"},{"$nulls":4},{"$error":"#N/A"},{"$error":"#N/A"},{"$error":"#N/A"},{"$error":"#N/A"}]
[33,null,{"$error":"#VALUE!"},{"$f":"E45*'Worksheet 1'!$AA$16","v":{"$error":"#VALUE!"}},{"$f":"E44+F42","v":{"$error":"#VALUE!"}},null,{"$f":"IF($B$10=\"unreefed\",'Worksheet 9'!$E$37*(COS(RADIANS('Worksheet 9a'!A45))^1.3),IF('Worksheet 9a'!$B$10=\"reefed\",'Worksheet 9'!$F$37*(COS(RADIANS('Worksheet 9a'!A45))^1.3),\"error\"))","v":"error"},{"$f":"C45+294*'Worksheet 2'!$I$12*COS(RADIANS('Worksheet 9a'!A45))","v":{"$error":"#VALUE!"}},{"$nulls":44},33,{"$error":"#VALUE!"},"error",{"$error":"#VALUE!"},{"$nulls":4},{"$error":"#N/A"},{"$error":"#N/A"},{"$error":"#N/A"},{"$error":"#N/A"}]
[34,null,{"$error":"#VALUE!"},{"$f":"E46*'Worksheet 1'!$AA$16","v":{"$error":"#VALUE!"}},{"$f":"E45+F42","v":{"$error":"#VALUE!"}},null,{"$f":"IF($B$10=\"unreefed\",'Worksheet 9'!$E$37*(COS(RADIANS('Worksheet 9a'!A46))^1.3),IF('Worksheet 9a'!$B$10=\"reefed\",'Worksheet 9'!$F$37*(COS(RADIANS('Worksheet 9a'!A46))^1.3),\"error\"))","v":"error"},{"$f":"C46+294*'Worksheet 2'!$I$12*COS(RADIANS('Worksheet 9a'!A46))","v":{"$error":"#VALUE!"}},{"$nulls":44},34,{"$error":"#VALUE!"},"error",{"$error":"#VALUE!"},{"$nulls":4},{"$error":"#N/A"},{"$error":"#N/A"},{"$error":"#N/A"},{"$error":"#N/A"}]
[35,null,{"$error":"#VALUE!"},{"$f":"E47*'Worksheet 1'!$AA$16","v":{"$error":"#VALUE!"}},{"$f":"IF($B$9=\"N m\",B47/9.806/'Worksheet 1'!$AA$16,IF($B$9=\"kg m\",B47/'Worksheet 1'!$AA$16,IF($B$9=\"m\",B47,\"error\")))","v":"error"},{"$f":"(E52-E47)/5","v":{"$error":"#VALUE!"}},{"$f":"IF($B$10=\"unreefed\",'Worksheet 9'!$E$37*(COS(RADIANS('Worksheet 9a'!A47))^1.3),IF('Worksheet 9a'!$B$10=\"reefed\",'Worksheet 9'!$F$37*(COS(RADIANS('Worksheet 9a'!A47))^1.3),\"error\"))","v":"error"},{"$f":"C47+294*'Worksheet 2'!$I$12*COS(RADIANS('Worksheet 9a'!A47))","v":{"$error":"#VALUE!"}},{"$nulls":44},35,{"$error":"#VALUE!"},"error",{"$error":"#VALUE!"},{"$nulls":4},{"$error":"#N/A"},{"$error":"#N/A"},{"$error":"#N/A"},{"$error":"#N/A"}]
[36,null,{"$error":"#VALUE!"},{"$f":"E48*'Worksheet 1'!$AA$16","v":{"$error":"#VALUE!"}},{"$f":"E47+F47","v":{"$error":"#VALUE!"}},null,{"$f":"IF($B$10=\"unreefed\",'Worksheet 9'!$E$37*(COS(RADIANS('Worksheet 9a'!A48))^1.3),IF('Worksheet 9a'!$B$10=\"reefed\",'Worksheet 9'!$F$37*(COS(RADIANS('Worksheet 9a'!A48))^1.3),\"error\"))","v":"error"},{"$f":"C48+294*'Worksheet 2'!$I$12*COS(RADIANS('Worksheet 9a'!A48))","v":{"$error":"#VALUE!"}},{"$nulls":44},36,{"$error":"#VALUE!"},"error",{"$error":"#VALUE!"},{"$nulls":4},{"$error":"#N/A"},{"$error":"#N/A"},{"$error":"#N/A"},{"$error":"#N/A"}]
[37,null,{"$error":"#VALUE!"},{"$f":"E49*'Worksheet 1'!$AA$16","v":{"$error":"#VALUE!"}},{"$f":"E48+F47","v":{"$error":"#VALUE!"}},null,{"$f":"IF($B$10=\"unreefed\",'Worksheet 9'!$E$37*(COS(RADIANS('Worksheet 9a'!A49))^1.3),IF('Worksheet 9a'!$B$10=\"reefed\",'Worksheet 9'!$F$37*(COS(RADIANS('Worksheet 9a'!A49))^1.3),\"error\"))","v":"error"},{"$f":"C49+294*'Worksheet 2'!$I$12*COS(RADIANS('Worksheet 9a'!A49))","v":{"$error":"#VALUE!"}},{"$nulls":44},37,{"$error":"#VALUE!"},"error",{"$error":"#VALUE!"},{"$nulls":4},{"$error":"#N/A"},{"$error":"#N/A"},{"$error":"#N/A"},{"$error":"#N/A"}]
[38,null,{"$error":"#VALUE!"},{"$f":"E50*'Worksheet 1'!$AA$16","v":{"$error":"#VALUE!"}},{"$f":"E49+F47","v":{"$error":"#VALUE!"}},null,{"$f":"IF($B$10=\"unreefed\",'Worksheet 9'!$E$37*(COS(RADIANS('Worksheet 9a'!A50))^1.3),IF('Worksheet 9a'!$B$10=\"reefed\",'Worksheet 9'!$F$37*(COS(RADIANS('Worksheet 9a'!A50))^1.3),\"error\"))","v":"error"},{"$f":"C50+294*'Worksheet 2'!$I$12*COS(RADIANS('Worksheet 9a'!A50))","v":{"$error":"#VALUE!"}},{"$nulls":44},38,{"$error":"#VALUE!"},"error",{"$error":"#VALUE!"},{"$nulls":4},{"$error":"#N/A"},{"$error":"#N/A"},{"$error":"#N/A"},{"$error":"#N/A"}]
[39,null,{"$error":"#VALUE!"},{"$f":"E51*'Worksheet 1'!$AA$16","v":{"$error":"#VALUE!"}},{"$f":"E50+F47","v":{"$error":"#VALUE!"}},null,{"$f":"IF($B$10=\"unreefed\",'Worksheet 9'!$E$37*(COS(RADIANS('Worksheet 9a'!A51))^1.3),IF('Worksheet 9a'!$B$10=\"reefed\",'Worksheet 9'!$F$37*(COS(RADIANS('Worksheet 9a'!A51))^1.3),\"error\"))","v":"error"},{"$f":"C51+294*'Worksheet 2'!$I$12*COS(RADIANS('Worksheet 9a'!A51))","v":{"$error":"#VALUE!"}},{"$nulls":44},39,{"$error":"#VALUE!"},"error",{"$error":"#VALUE!"},{"$nulls":4},{"$error":"#N/A"},{"$error":"#N/A"},{"$error":"#N/A"},{"$error":"#N/A"}]
[40,null,{"$error":"#VALUE!"},{"$f":"E52*'Worksheet 1'!$AA$16","v":{"$error":"#VALUE!"}},{"$f":"IF($B$9=\"N m\",B52/9.806/'Worksheet 1'!$AA$16,IF($B$9=\"kg m\",B52/'Worksheet 1'!$AA$16,IF($B$9=\"m\",B52,\"error\")))","v":"error"},{"$f":"(E57-E52)/5","v":{"$error":"#VALUE!"}},{"$f":"IF($B$10=\"unreefed\",'Worksheet 9'!$E$37*(COS(RADIANS('Worksheet 9a'!A52))^1.3),IF('Worksheet 9a'!$B$10=\"reefed\",'Worksheet 9'!$F$37*(COS(RADIANS('Worksheet 9a'!A52))^1.3),\"error\"))","v":"error"},{"$f":"C52+294*'Worksheet 2'!$I$12*COS(RADIANS('Worksheet 9a'!A52))","v":{"$error":"#VALUE!"}},{"$nulls":44},40,{"$error":"#VALUE!"},"error",{"$error":"#VALUE!"},{"$nulls":4},{"$error":"#N/A"},{"$error":"#N/A"},{"$error":"#N/A"},{"$error":"#N/A"}]
[41,null,{"$error":"#VALUE!"},{"$f":"E53*'Worksheet 1'!$AA$16","v":{"$error":"#VALUE!"}},{"$f":"E52+F52","v":{"$error":"#VALUE!"}},null,{"$f":"IF($B$10=\"unreefed\",'Worksheet 9'!$E$37*(COS(RADIANS('Worksheet 9a'!A53))^1.3),IF('Worksheet 9a'!$B$10=\"reefed\",'Worksheet 9'!$F$37*(COS(RADIANS('Worksheet 9a'!A53))^1.3),\"error\"))","v":"error"},{"$f":"C53+294*'Worksheet 2'!$I$12*COS(RADIANS('Worksheet 9a'!A53))","v":{"$error":"#VALUE!"}},{"$nulls":44},41,{"$error":"#VALUE!"},"error",{"$error":"#VALUE!"},{"$nulls":4},{"$error":"#N/A"},{"$error":"#N/A"},{"$error":"#N/A"},{"$error":"#N/A"}]
[42,null,{"$error":"#VALUE!"},{"$f":"E54*'Worksheet 1'!$AA$16","v":{"$error":"#VALUE!"}},{"$f":"E53+F52","v":{"$error":"#VALUE!"}},null,{"$f":"IF($B$10=\"unreefed\",'Worksheet 9'!$E$37*(COS(RADIANS('Worksheet 9a'!A54))^1.3),IF('Worksheet 9a'!$B$10=\"reefed\",'Worksheet 9'!$F$37*(COS(RADIANS('Worksheet 9a'!A54))^1.3),\"error\"))","v":"error"},{"$f":"C54+294*'Worksheet 2'!$I$12*COS(RADIANS('Worksheet 9a'!A54))","v":{"$error":"#VALUE!"}},{"$nulls":44},42,{"$error":"#VALUE!"},"error",{"$error":"#VALUE!"},{"$nulls":4},{"$error":"#N/A"},{"$error":"#N/A"},{"$error":"#N/A"},{"$error":"#N/A"}]
[43,null,{"$error":"#VALUE!"},{"$f":"E55*'Worksheet 1'!$AA$16","v":{"$error":"#VALUE!"}},{"$f":"E54+F52","v":{"$error":"#VALUE!"}},null,{"$f":"IF($B$10=\"unreefed\",'Worksheet 9'!$E$37*(COS(RADIANS('Worksheet 9a'!A55))^1.3),IF('Worksheet 9a'!$B$10=\"reefed\",'Worksheet 9'!$F$37*(COS(RADIANS('Worksheet 9a'!A55))^1.3),\"error\"))","v":"error"},{"$f":"C55+294*'Worksheet 2'!$I$12*COS(RADIANS('Worksheet 9a'!A55))","v":{"$error":"#VALUE!"}},{"$nulls":44},43,{"$error":"#VALUE!"},"error",{"$error":"#VALUE!"},{"$nulls":4},{"$error":"#N/A"},{"$error":"#N/A"},{"$error":"#N/A"},{"$error":"#N/A"}]
[44,null,{"$error":"#VALUE!"},{"$f":"E56*'Worksheet 1'!$AA$16","v":{"$error":"#VALUE!"}},{"$f":"E55+F52","v":{"$error":"#VALUE!"}},null,{"$f":"IF($B$10=\"unreefed\",'Worksheet 9'!$E$37*(COS(RADIANS('Worksheet 9a'!A56))^1.3),IF('Worksheet 9a'!$B$10=\"reefed\",'Worksheet 9'!$F$37*(COS(RADIANS('Worksheet 9a'!A56))^1.3),\"error\"))","v":"error"},{"$f":"C56+294*'Worksheet 2'!$I$12*COS(RADIANS('Worksheet 9a'!A56))","v":{"$error":"#VALUE!"}},{"$nulls":44},44,{"$error":"#VALUE!"},"error",{"$error":"#VALUE!"},{"$nulls":4},{"$error":"#N/A"},{"$error":"#N/A"},{"$error":"#N/A"},{"$error":"#N/A"}]
[45,null,{"$error":"#VALUE!"},{"$f":"E57*'Worksheet 1'!$AA$16","v":{"$error":"#VALUE!"}},{"$f":"IF($B$9=\"N m\",B57/9.806/'Worksheet 1'!$AA$16,IF($B$9=\"kg m\",B57/'Worksheet 1'!$AA$16,IF($B$9=\"m\",B57,\"error\")))","v":"error"},{"$f":"(E62-E57)/5","v":{"$error":"#VALUE!"}},{"$f":"IF($B$10=\"unreefed\",'Worksheet 9'!$E$37*(COS(RADIANS('Worksheet 9a'!A57))^1.3),IF('Worksheet 9a'!$B$10=\"reefed\",'Worksheet 9'!$F$37*(COS(RADIANS('Worksheet 9a'!A57))^1.3),\"error\"))","v":"error"},{"$f":"C57+294*'Worksheet 2'!$I$12*COS(RADIANS('Worksheet 9a'!A57))","v":{"$error":"#VALUE!"}},{"$nulls":44},45,{"$error":"#VALUE!"},"error",{"$error":"#VALUE!"},{"$nulls":4},{"$error":"#N/A"},{"$error":"#N/A"},{"$error":"#N/A"},{"$error":"#N/A"}]
[46,null,{"$error":"#VALUE!"},{"$f":"E58*'Worksheet 1'!$AA$16","v":{"$error":"#VALUE!"}},{"$f":"E57+F57","v":{"$error":"#VALUE!"}},null,{"$f":"IF($B$10=\"unreefed\",'Worksheet 9'!$E$37*(COS(RADIANS('Worksheet 9a'!A58))^1.3),IF('Worksheet 9a'!$B$10=\"reefed\",'Worksheet 9'!$F$37*(COS(RADIANS('Worksheet 9a'!A58))^1.3),\"error\"))","v":"error"},{"$f":"C58+294*'Worksheet 2'!$I$12*COS(RADIANS('Worksheet 9a'!A58))","v":{"$error":"#VALUE!"}},{"$nulls":44},46,{"$error":"#VALUE!"},"error",{"$error":"#VALUE!"},{"$nulls":4},{"$error":"#N/A"},{"$error":"#N/A"},{"$error":"#N/A"},{"$error":"#N/A"}]
[47,null,{"$error":"#VALUE!"},{"$f":"E59*'Worksheet 1'!$AA$16","v":{"$error":"#VALUE!"}},{"$f":"E58+F57","v":{"$error":"#VALUE!"}},null,{"$f":"IF($B$10=\"unreefed\",'Worksheet 9'!$E$37*(COS(RADIANS('Worksheet 9a'!A59))^1.3),IF('Worksheet 9a'!$B$10=\"reefed\",'Worksheet 9'!$F$37*(COS(RADIANS('Worksheet 9a'!A59))^1.3),\"error\"))","v":"error"},{"$f":"C59+294*'Worksheet 2'!$I$12*COS(RADIANS('Worksheet 9a'!A59))","v":{"$error":"#VALUE!"}},{"$nulls":44},47,{"$error":"#VALUE!"},"error",{"$error":"#VALUE!"},{"$nulls":4},{"$error":"#N/A"},{"$error":"#N/A"},{"$error":"#N/A"},{"$error":"#N/A"}]
[48,null,{"$error":"#VALUE!"},{"$f":"E60*'Worksheet 1'!$AA$16","v":{"$error":"#VALUE!"}},{"$f":"E59+F57","v":{"$error":"#VALUE!"}},null,{"$f":"IF($B$10=\"unreefed\",'Worksheet 9'!$E$37*(COS(RADIANS('Worksheet 9a'!A60))^1.3),IF('Worksheet 9a'!$B$10=\"reefed\",'Worksheet 9'!$F$37*(COS(RADIANS('Worksheet 9a'!A60))^1.3),\"error\"))","v":"error"},{"$f":"C60+294*'Worksheet 2'!$I$12*COS(RADIANS('Worksheet 9a'!A60))","v":{"$error":"#VALUE!"}},{"$nulls":44},48,{"$error":"#VALUE!"},"error",{"$error":"#VALUE!"},{"$nulls":4},{"$error":"#N/A"},{"$error":"#N/A"},{"$error":"#N/A"},{"$error":"#N/A"}]
[49,null,{"$error":"#VALUE!"},{"$f":"E61*'Worksheet 1'!$AA$16","v":{"$error":"#VALUE!"}},{"$f":"E60+F57","v":{"$error":"#VALUE!"}},null,{"$f":"IF($B$10=\"unreefed\",'Worksheet 9'!$E$37*(COS(RADIANS('Worksheet 9a'!A61))^1.3),IF('Worksheet 9a'!$B$10=\"reefed\",'Worksheet 9'!$F$37*(COS(RADIANS('Worksheet 9a'!A61))^1.3),\"error\"))","v":"error"},{"$f":"C61+294*'Worksheet 2'!$I$12*COS(RADIANS('Worksheet 9a'!A61))","v":{"$error":"#VALUE!"}},{"$nulls":44},49,{"$error":"#VALUE!"},"error",{"$error":"#VALUE!"},{"$nulls":4},{"$error":"#N/A"},{"$error":"#N/A"},{"$error":"#N/A"},{"$error":"#N/A"}]
[50,null,{"$error":"#VALUE!"},{"$f":"E62*'Worksheet 1'!$AA$16","v":{"$error":"#VALUE!"}},{"$f":"IF($B$9=\"N m\",B62/9.806/'Worksheet 1'!$AA$16,IF($B$9=\"kg m\",B62/'Worksheet 1'!$AA$16,IF($B$9=\"m\",B62,\"error\")))","v":"error"},{"$f":"(#REF!-E62)/5","v":{"$error":"#REF!"}},{"$f":"IF($B$10=\"unreefed\",'Worksheet 9'!$E$37*(COS(RADIANS('Worksheet 9a'!A62))^1.3),IF('Worksheet 9a'!$B$10=\"reefed\",'Worksheet 9'!$F$37*(COS(RADIANS('Worksheet 9a'!A62))^1.3),\"error\"))","v":"error"},{"$f":"C62+294*'Worksheet 2'!$I$12*COS(RADIANS('Worksheet 9a'!A62))","v":{"$error":"#VALUE!"}},{"$nulls":44},50,{"$error":"#VALUE!"},"error",{"$error":"#VALUE!"},{"$nulls":4},{"$error":"#N/A"},{"$error":"#N/A"},{"$error":"#N/A"},{"$error":"#N/A"}]
[{"$nulls":60},{"$error":"#N/A"},{"$error":"#N/A"},{"$error":"#N/A"},{"$error":"#N/A"}]
[null,"point of intersection of righting moment curve and wind heeling moment curve",{"$nulls":58},{"$error":"#N/A"},{"$error":"#N/A"},{"$error":"#N/A"},{"$error":"#N/A"}]
[null,"ΦC",{"$nulls":58},{"$error":"#N/A"},{"$error":"#N/A"},{"$error":"#N/A"},{"$error":"#N/A"}]
[null,{"$f":"BG15","v":""},"degree",{"$nulls":57},{"$error":"#N/A"},{"$error":"#N/A"},{"$error":"#N/A"},{"$error":"#N/A"}]
[{"$nulls":60},{"$error":"#N/A"},{"$error":"#N/A"},{"$error":"#N/A"},{"$error":"#N/A"}]
[{"$nulls":60},{"$error":"#N/A"},{"$error":"#N/A"},{"$error":"#N/A"},{"$error":"#N/A"}]
[{"$nulls":60},{"$error":"#N/A"},{"$error":"#N/A"},{"$error":"#N/A"},{"$error":"#N/A"}]
[{"$nulls":60},{"$error":"#N/A"},{"$error":"#N/A"},{"$error":"#N/A"},{"$error":"#N/A"}]
[{"$nulls":60},{"$error":"#N/A"},{"$error":"#N/A"},{"$error":"#N/A"},{"$error":"#N/A"}]
[{"$nulls":60},{"$error":"#N/A"},{"$error":"#N/A"},{"$error":"#N/A"},{"$error":"#N/A"}]
[{"$nulls":60},{"$error":"#N/A"},{"$error":"#N/A"},{"$error":"#N/A"},{"$error":"#N/A"}]
[{"$nulls":60},{"$error":"#N/A"},{"$error":"#N/A"},{"$error":"#N/A"},{"$error":"#N/A"}]
[{"$nulls":60},{"$error":"#N/A"},{"$error":"#N/A"},{"$error":"#N/A"},{"$error":"#N/A"}]
[{"$nulls":60},{"$error":"#N/A"},{"$error":"#N/A"},{"$error":"#N/A"},{"$error":"#N/A"}]
[{"$nulls":60},{"$error":"#N/A"},{"$error":"#N/A"},{"$error":"#N/A"},{"$f":"IF(AND(BJ76<BK76,BJ77>BK77),1,\"\")","v":{"$error":"#N/A"}}]
[{"$nulls":60},{"$f":"BI77+0.01","v":{"$error":"#N/A"}},{"$f":"BJ77+$BG$23","v":{"$error":"#N/A"}},{"$f":"BK77+$BG$29","v":{"$error":"#N/A"}},{"$error":"#N/A"}]
[{"$nulls":60},{"$error":"#N/A"},{"$error":"#N/A"},{"$error":"#N/A"},{"$error":"#N/A"}]
[{"$nulls":60},{"$error":"#N/A"},{"$error":"#N/A"},{"$error":"#N/A"},{"$error":"#N/A"}]
[{"$nulls":60},{"$error":"#N/A"},{"$error":"#N/A"},{"$error":"#N/A"},{"$error":"#N/A"}]
[{"$nulls":60},{"$error":"#N/A"},{"$error":"#N/A"},{"$error":"#N/A"},{"$error":"#N/A"}]
[{"$nulls":60},{"$error":"#N/A"},{"$error":"#N/A"},{"$error":"#N/A"},{"$error":"#N/A"}]
[{"$nulls":60},{"$error":"#N/A"},{"$error":"#N/A"},{"$error":"#N/A"},{"$error":"#N/A"}]
[{"$nulls":60},{"$error":"#N/A"},{"$error":"#N/A"},{"$error":"#N/A"},{"$error":"#N/A"}]
[{"$nulls":60},{"$error":"#N/A"},{"$error":"#N/A"},{"$error":"#N/A"},{"$error":"#N/A"}]
[{"$nulls":60},{"$error":"#N/A"},{"$error":"#N/A"},{"$error":"#N/A"},{"$error":"#N/A"}]
[{"$nulls":60},{"$error":"#N/A"},{"$error":"#N/A"},{"$error":"#N/A"},{"$error":"#N/A"}]
[{"$nulls":60},{"$error":"#N/A"},{"$error":"#N/A"},{"$error":"#N/A"},{"$error":"#N/A"}]
[{"$nulls":60},{"$error":"#N/A"},{"$error":"#N/A"},{"$error":"#N/A"},{"$error":"#N/A"}]
[{"$nulls":60},{"$error":"#N/A"},{"$error":"#N/A"},{"$error":"#N/A"},{"$error":"#N/A"}]
[{"$nulls":60},{"$error":"#N/A"},{"$error":"#N/A"},{"$error":"#N/A"},{"$error":"#N/A"}]
[{"$nulls":60},{"$error":"#N/A"},{"$error":"#N/A"},{"$error":"#N/A"},{"$error":"#N/A"}]
[{"$nulls":60},{"$error":"#N/A"},{"$error":"#N/A"},{"$error":"#N/A"},{"$error":"#N/A"}]
[{"$nulls":60},{"$error":"#N/A"},{"$error":"#N/A"},{"$error":"#N/A"},{"$error":"#N/A"}]
[{"$nulls":60},{"$error":"#N/A"},{"$error":"#N/A"},{"$error":"#N/A"},{"$error":"#N/A"}]
[{"$nulls":60},{"$error":"#N/A"},{"$error":"#N/A"},{"$error":"#N/A"},{"$error":"#N/A"}]
[{"$nulls":60},{"$error":"#N/A"},{"$error":"#N/A"},{"$error":"#N/A"},{"$error":"#N/A"}]
[{"$nulls":60},{"$error":"#N/A"},{"$error":"#N/A"},{"$error":"#N/A"},{"$error":"#N/A"}]
[{"$nulls":60},{"$error":"#N/A"},{"$error":"#N/A"},{"$error":"#N/A"},{"$error":"#N/A"}]
[{"$nulls":60},{"$error":"#N/A"},{"$error":"#N/A"},{"$error":"#N/A"},{"$error":"#N/A"}]
[{"$nulls":60},{"$error":"#N/A"},{"$error":"#N/A"},{"$error":"#N/A"},{"$error":"#N/A"}]
[{"$nulls":60},{"$error":"#N/A"},{"$error":"#N/A"},{"$error":"#N/A"},{"$error":"#N/A"}]
[{"$nulls":60},{"$error":"#N/A"},{"$error":"#N/A"},{"$error":"#N/A"},{"$error":"#N/A"}]
[{"$nulls":60},{"$error":"#N/A"},{"$error":"#N/A"},{"$error":"#N/A"},{"$error":"#N/A"}]
[{"$nulls":60},{"$error":"#N/A"},{"$error":"#N/A"},{"$error":"#N/A"},{"$error":"#N/A"}]
[{"$nulls":60},{"$error":"#N/A"},{"$error":"#N/A"},{"$error":"#N/A"},{"$error":"#N/A"}]
[{"$nulls":60},{"$error":"#N/A"},{"$error":"#N/A"},{"$error":"#N/A"},{"$error":"#N/A"}]
[{"$nulls":60},{"$error":"#N/A"},{"$error":"#N/A"},{"$error":"#N/A"},{"$error":"#N/A"}]
[{"$nulls":60},{"$error":"#N/A"},{"$error":"#N/A"},{"$error":"#N/A"},{"$error":"#N/A"}]
[{"$nulls":60},{"$error":"#N/A"},{"$error":"#N/A"},{"$error":"#N/A"},{"$error":"#N/A"}]
[{"$nulls":60},{"$error":"#N/A"},{"$error":"#N/A"},{"$error":"#N/A"},{"$error":"#N/A"}]

{"sheet":"Worksheet 10","index":16,"n_rows":41,"n_cols":8,"rows_kept":41,"merged":[[0,6,0,7],[2,0,2,4],[4,0,4,4],[7,0,7,4],[31,0,31,2],[32,0,32,2],[33,0,33,2],[34,0,34,2],[35,0,35,2],[37,0,37,2],[39,0,39,2],[40,0,40,2]]}
[{"$nulls":6},"Comments"]
[{"$nulls":7}," Derived values"]
["ISO 12217-2:2017  CALCULATION  WORKSHEET  No. 10 FLOTATION  REQUIREMENT ",{"$nulls":6}," Input values"]
[{"$nulls":7}," Default values, but alterable"]
[{"$f":"CONCATENATE(coverSheet!B5,\"          \",coverSheet!B12)","v":"          "}]
[]
["Annex D"]
["Objective: to show that the buoyancy available from the hull structure, fittings and flotation elements equals or exceeds that required to support the loaded boat."]
[]
["Item","Mass","Density","Volume","Ref."]
[null,"[kg]","[kg/m³]","[m³]"]
["Hull structure"]
["GRP Laminate",null,1500,{"$f":"IF(B13=\"\",\"\",IF(C13=\"\",\"\",B13/C13))","v":""},"Table D.1"]
["Foam core materials",null,80,{"$f":"IF(B14=\"\",\"\",IF(C14=\"\",\"\",B14/C14))","v":""},"Table D.1"]
["Balsa core materials",null,150,"","Table D.1"]
["Plywood",null,600,"","Table D.1"]
["Other timber",null,600,"","Table D.1"]
["Permanent balast",null,7800,"","Table D.1"]
["Fastenings and other metalwork",null,5000,"","Table D.1"]
["Windows",null,2300,"","Table D.1"]
["Engines and other fittings an equipment",null,null,{"$f":"IF(B21<>\"\",ROUND(B21/C21,3),\"\")","v":""}]
["Diesel engines",null,5000,{"$f":"IF(B22=\"\",\"\",IF(C22=\"\",\"\",B22/C22))","v":""},"Table D.1"]
["Petrol engines",null,4000,"","Table D.1"]
["Outboard engines",null,3000,"","Table D.1"]
["Sail-drive or stern-drive",null,4000,"","Table D.1"]
["Mast(s) and Spar(s)",null,2700,"","Table D.1"]
["Stowed sails and ropes",null,1200,"","Table D.1"]
["Food and other stores",null,2000,"","Table D.1"]
["Miscellaneous equipment",null,2000,"","Table D.1"]
["Non-integral fuel tanks",null,null,"","Table D.1"]
["Non-integral water tanks",null,null,"","Table D.1"]
["Gross volumes of fixed tanks and air containers",{"$nulls":3},"D.2.2"]
["Fuel tanks",{"$nulls":3},"D.2.2"]
["Water tanks",{"$nulls":3},"D.2.2"]
["Other tanks",{"$nulls":3},"D.2.2"]
["Air tanks or container meeting the requirement of annex E",{"$nulls":3},"D.2.2"]
[]
["Total volume of hull, fittings and equipment, VB   Sum ",null,null,{"$f":"SUM(D13:D36)","v":0}]
["Mass in the maximum load condition","mLDC","kg",{"$f":"'Worksheet 1'!I35","v":0},"3.5.5"]
["calculate ratio mLDC / VB    .",null,null,{"$f":"IF(D39=\"\",\"\",D39/D38)","v":{"$error":"#DIV/0!"}}]
["For options 4, 6 and 8     mLDC / VB < 850 ?",null,null,{"$f":"IF(D40<850,\"Pass\",\"Fail\")","v":{"$error":"#DIV/0!"}}]

{"sheet":"Worksheet 11","index":17,"n_rows":23,"n_cols":27,"rows_kept":23,"merged":[[0,6,0,7],[2,0,2,4],[4,0,4,4],[6,0,6,4],[8,0,8,4],[10,0,10,1],[11,0,11,1],[12,0,12,1],[13,0,13,1],[14,0,14,1],[15,0,15,1],[16,0,16,1],[17,0,17,1],[18,0,18,1],[19,1,19,4],[20,1,20,4],[21,1,21,3],[22,0,22,1],[22,2,22,3]]}
[{"$nulls":6},"Comments"]
[{"$nulls":7}," Derived values",{"$nulls":18},"List:"]
["ISO 12217-2:2017 CALCULATION  WORKSHEET No.11         CAPSIZE-RECOVERY TEST",{"$nulls":6}," Input values",{"$nulls":18},"Yes"]
[{"$nulls":26},"No"]
[{"$f":"CONCATENATE(coverSheet!B5,\"          \",coverSheet!B12)","v":"          "}]
[{"$nulls":26},"Water"]
["Design Categories C and D only",{"$nulls":25},"Weights"]
[]
["Objective: to demonstrate that a boat can be returned to the upright after a capsize by the actions of the crew using their body action and/or righting devices purposely designed and permanently fitted to the boat, that it will subsequently float, and to verify that the recommended minimum crew mass is sufficient for the recovery method used.",{"$nulls":25},"experimental"]
[{"$nulls":26},"theoretical"]
["Item",null,"Unit","Value","Ref."]
["Minimum number of crewrequired",null,"---",null,"6.10.7"]
["Minimum mass of crew required",null,"kg",null,"6.10.7"]
["Is boat prepared as in 6.10.2 to 6.10.5 ?                                                ",null,"Yes / No",null,"6.10.2-5"]
["Does boat float for > 5 min when fully capsized ?                                  ",null,"Yes / No",null,"6.10.6"]
["Time required to right the boat (least time of 1 to 3 attempts)",null,"minutes",null,"6.10.8"]
["Is this time less than 5 min?",null,"Yes / No",null,"6.10.8"]
["With one 75 kg person aboard, boat floats so it can be pumped or bailed out ?",null,"Yes / No",null,"6.10.10"]
["With full Crew Limit aboard, without bailing, boat floats approx. level with at least 2/3 periphery showing, for more than 5 min ?                                        ",null,"Yes / No",null,"6.10.11"]
["INFORMATION FOR OWNER'S MANUAL:\nLikelihood of capsize occuring in normal use:"]
["Righting technique which is most successful:"]
["Minimum number of crew required?                      ","Minimum mass of crew required (kg):"]
["Design category recommended by the builder:  ",null,{"$f":"'Worksheet 1'!D8","v":0}]

{"sheet":"Worksheet 15","index":18,"n_rows":17,"n_cols":53,"rows_kept":17,"merged":[[0,13,0,14],[2,0,2,8],[4,0,4,8],[6,0,6,6],[7,0,7,6],[8,0,8,6],[9,0,9,6],[10,0,10,6],[11,0,11,6],[12,0,12,6],[13,0,13,6],[14,0,14,6],[15,0,15,6],[16,0,16,6]]}
[{"$nulls":13},"Comments"]
[{"$nulls":14},"Derived values"]
["ISO 12217-2:2017 CALCULATION WORKSHEET No. 15                                      DETECTION + REMOVAL OF WATER",{"$nulls":13},"Input values"]
[]
[{"$f":"CONCATENATE(coverSheet!B5,\"          \",coverSheet!B12)","v":"          "}]
[{"$nulls":52},"list:"]
["Item",{"$nulls":6},"response","Ref.",{"$nulls":43},"Yes"]
["The internal arrangement facilitates the drainage of water to bilge suction point(s), to a location from which it can be bailed rapidly, or directly overboard?                                      ",{"$nulls":7},"6.11.1",{"$nulls":43},"No"]
["Is boat provided with a means of removing water from the bilges in accordance with 15083?",{"$nulls":7},"6.11.2"]
["Table 2 option used for assessment:",{"$nulls":7},"6.11.3"]
["Can water in boat be detected from helm position?",{"$nulls":7},"6.11.3"]
["For boats in design cat C using option 3,5 or 7:                                         option (see worksheet 2):",{"$nulls":6},{"$f":"IF(OR('Worksheet 2'!E49=3,'Worksheet 2'!E49=5,'Worksheet 2'!E49=7),'Worksheet 2'!E49,\"n.a.\")","v":"n.a."},"6.11.3"]
["Methods used:                                                                                            direct visual inspection",{"$nulls":7},"6.11.3"]
["                                                                  transparent inspection panels",{"$nulls":7},"6.11.3"]
["                                                                                           bilge alarms",{"$nulls":7},"6.11.3",null,"for clarification: ISO 15083 requires for all fully decked boats one or more bilge pumps."]
["                                  indication of the operation of automatic bilge pumps",{"$nulls":7},"6.11.3",null,"for open boats with flotation (option 4 and 6) requirements of 6.11.3 are not applicable"]
["other means (specify):",{"$nulls":7},"6.11.3",null,"for all open or partially decked boats in cat C, for which no requirements of ISO 15083 exists, clause 6.11.3 requires methods of detection and removal of water "]

{"sheet":"Worksheet 16","index":19,"n_rows":63,"n_cols":53,"rows_kept":63,"merged":[[0,14,0,15],[2,0,2,9],[4,2,4,9],[7,1,7,5],[7,7,7,8],[8,0,17,0],[8,7,8,8],[9,7,9,8],[10,7,10,8],[11,7,11,8],[12,7,12,8],[13,7,13,8],[14,7,14,8],[15,7,15,8],[16,7,16,8],[17,7,17,8],[18,7,18,8],[20,0,20,3],[20,4,20,5],[20,7,20,8],[21,0,27,0],[21,3,21,8],[23,3,23,8],[24,1,24,3],[24,4,24,5],[25,1,25,3],[25,4,25,5],[26,1,26,3],[26,4,26,5],[27,1,27,3],[27,4,27,5],[28,0,30,0],[28,3,28,7],[29,4,29,5],[30,4,30,5],[31,0,34,0],[31,1,31,8],[32,4,32,5],[32,7,32,8],[33,1,34,3],[33,4,34,5],[33,6,34,6],[33,7,34,8],[33,9,34,9],[35,1,35,3],[35,4,35,5],[35,7,35,8],[36,0,37,0],[36,1,36,3],[36,4,36,5],[37,1,37,3],[37,4,37,8],[38,1,38,3],[38,4,38,5],[39,0,40,0],[39,1,39,4],[39,5,39,6],[39,7,39,8],[40,1,40,6],[40,7,40,8],[41,0,42,0],[41,1,41,8],[42,1,42,6],[42,7,42,8],[43,0,44,0],[43,1,43,2],[43,3,43,5],[43,6,44,6],[43,7,44,8],[43,9,44,9],[44,1,44,3],[45,0,46,0],[45,1,45,2],[45,7,45,8],[46,1,46,6],[46,7,46,8],[47,1,47,6],[47,7,47,8],[48,0,48,9],[49,0,49,1],[49,4,49,9],[51,0,51,4]]}
[{"$nulls":14},"Comments"]
[{"$nulls":15},"Derived values"]
["ISO 12217-2:2017 en210301     CALCULATION WORKSHEET No.16                                                                         SUMMARY",{"$nulls":14},"Input values"]
[{"$nulls":26},"Yes"]
["Design Description:",null,{"$f":"CONCATENATE(coverSheet!B5,\"    \",coverSheet!B12)","v":"    "},{"$nulls":23},"No"]
["Design Category intended:      ",null,{"$f":"'Worksheet 1'!D8","v":0},"Crew Limit: ",{"$f":"'Worksheet 1'!I18","v":0},null,"Date: ",{"$f":"TODAY()","v":"2021-03-03"}]
[]
["Sheet","Item",{"$nulls":4},"Symbol","Unit",null,"Value"]
[1,"Length of hull: (as in ISO 8666)",{"$nulls":4},"LH","m",null,{"$f":"'Worksheet 1'!I10","v":{"v":0,"d":"0.00"}}]
[null,"Length of waterline",{"$nulls":4},"LWL","m",null,{"$f":"'Worksheet 1'!I11","v":{"v":0,"d":"0.00"}}]
[null,"Mass:"]
[null,"Empty craft mass",{"$nulls":4},"mEC","kg",null,{"$f":"'Worksheet 1'!I12","v":0}]
[null,"Maximum load",{"$nulls":4},"mL","kg",null,{"$f":"'Worksheet 1'!I34","v":0}]
[null,"Maximum recommended load for builder's plate",{"$nulls":5},"kg",null,{"$f":"'Worksheet 1'!I45","v":0}]
[null,"Light craft condition mass",{"$nulls":4},"mLC","kg",null,{"$f":"'Worksheet 1'!I16","v":0}]
[null,"Maximum Loaded condition mass = mLC + mML",{"$nulls":4},"mLDC","kg",null,{"$f":"'Worksheet 1'!I35","v":0}]
[null,"Loaded arival condition mass ",{"$nulls":4},"mLA","kg",null,{"$f":"'Worksheet 1'!I37","v":0}]
[null,"Minimum operating condition mass",{"$nulls":4},"mMO","kg",null,{"$f":"'Worksheet 1'!I44","v":0}]
[1,"Is boat sail or non-sail?",{"$nulls":5},"SAIL/NON-SAIL",null,{"$f":"'Worksheet 1'!I49","v":""}]
[2,"Option selected:",{"$nulls":7},{"$f":"'Worksheet 2'!E49","v":0}]
[{"$nulls":4},"Unit",null,"Required","Actual",null,"Pass/Fail"]
[3,"Downflooding openings:",null,"Are all requirements met?",{"$nulls":5},{"$f":"IF(L22=\"Please fill in worksheet 3a and 3b; otherwise you will receive a fail in J22\",\"Fail\",IF(AND(OR('Worksheet 1'!D8=\"A\",'Worksheet 1'!D8=\"B\"),'Worksheet 3'!H15=\"A\"),\"Pass\",IF(AND(OR('Worksheet 1'!D8=\"C\",'Worksheet 1'!D8=\"D\"),'Worksheet 3'!H15=\"C\"),\"Pass\",\"Fail\")))","v":"Fail"},null,{"$f":"IF('Worksheet 3b Overview'!A11=\"\",\"Please fill in worksheet 3a and 3b; otherwise you will receive a fail in J22\",\"\")","v":"Please fill in worksheet 3a and 3b; otherwise you will receive a fail in J22"}]
[{"$nulls":3},"Watertighness test for closing appliances done successful?",{"$nulls":5},{"$f":"'Worksheet 3b Overview'!BC13","v":"n.a."}]
[{"$nulls":3},"Exemptions ok or openings considered as possible downflooding openings?",{"$nulls":5},{"$f":"'Worksheet 3'!BB21","v":"n.a."}]
[null,"Downflooding angle:",{"$nulls":4},"Required","mMO","mLA","Pass/Fail",{"$nulls":42},"List:"]
[null,"to any opening ΦDA   .",null,null,"degrees",null,{"$f":"'Worksheet 3'!H34","v":{"v":30,"d":"> 30"}},{"$f":"'Worksheet 3'!H35","v":{"v":0,"d":"0.0"}},{"$f":"'Worksheet 3'!H36","v":{"v":0,"d":"0.0"}},{"$f":"IF(MIN(H26:I26)>'Worksheet 3'!H34,\"Pass\",\"Fail\")","v":"Fail"}]
[null,"to non-quickdraining opening ΦDC   .",null,null,"degrees",null,null,{"$f":"IF('Worksheet 3'!H39=\"\",\"\",'Worksheet 3'!H39)","v":""},{"$f":"IF('Worksheet 3'!H40=\"\",\"\",'Worksheet 3'!H40)","v":""}]
[null,"to main access hatchway ΦDH   .",null,null,"degrees",null,null,{"$f":"'Worksheet 3'!H41","v":{"v":0,"d":"0.0"}},{"$f":"'Worksheet 3'!H42","v":{"v":0,"d":"0.0"}}]
["3 & 4","Downflooding height:",null,"Worksheet employed for basic height",{"$nulls":48},"Yes"]
[null,"basic requirement",null,null,"m",null,{"$f":"IF('Worksheet 3'!F48=\"annex A\",'Worksheet 4'!AY36,LOOKUP('Worksheet 1'!D8,'Worksheet 3'!E50:E53,'Worksheet 3'!F50:F53))","v":{"$error":"#N/A"}},null,{"$f":"'Worksheet 3'!F54","v":{"v":0,"d":"0.00"}},{"$f":"IF(I30>'Worksheet 16'!G30,\"Pass\",\"Fail\")","v":{"$error":"#N/A"}},{"$nulls":42},"No"]
[null,"reduced height for small openings (only using figures)",null,null,"m",null,{"$f":"IF('Worksheet 3'!F48=\"annex A\",\"n.a.\",LOOKUP('Worksheet 1'!D8,'Worksheet 3'!E50:E53,'Worksheet 3'!H50:H53))","v":{"$error":"#N/A"}},null,{"$f":"'Worksheet 3'!H54","v":{"v":0,"d":"0.00"}},{"$f":"IF(G31=\"n.a.\",\"n.a.\",IF('Worksheet 3'!F48=\"fig. 2\",IF(I31>=G31,\"Pass\",\"Fail\")))","v":{"$error":"#N/A"}}]
[5,"Recess size: (option 1 using 6.5.2, and option 5,6  except cat D )",{"$nulls":50},"A"]
[null,"Simplified method: max reduction in GMT",null,null,"%",null,{"$f":"CONCATENATE(\"≤\",\"   \",MAX('Worksheet 5'!E59:F64))","v":"≤   0"},{"$f":"IF(AND('Worksheet 5'!E70=\"\",'Worksheet 5'!E76=\"\",'Worksheet 5'!E84=\"\"),\"not used\",MIN('Worksheet 5'!E70,'Worksheet 5'!E76,'Worksheet 5'!E84))","v":"not used"},null,{"$f":"'Worksheet 5'!E87","v":"n.a."},{"$nulls":42},"B"]
[null,"Direct calculation: margin righting moment over heeling moment",null,null,"N m",null,{"$f":"IF('Worksheet 5'!E91=\"\",\"\",CONCATENATE(\"≥\",\"     \",'Worksheet 5'!E92))","v":""},{"$f":"'Worksheet 5'!E91","v":0},null,{"$f":"IF(G34=\"\",\"\",IF(H34>'Worksheet 5'!E92,\"Pass\",\"Fail\"))","v":""},{"$nulls":42},"C"]
[{"$nulls":52},"D"]
[6,"Minimum righting energy: (option 1 only)",null,null,"kg m degree",null,{"$f":"IF('Worksheet 1'!D8=\"A\",172000,IF('Worksheet 1'!D8=\"B\", 57000,\"n.a.\"))","v":"n.a."},{"$f":"'Worksheet 6'!D11","v":{"$error":"#VALUE!"}},null,{"$f":"IF('Worksheet 2'!E49=1,IF(H36>G36,\"Pass\",\"Fail\"),\"n.a.\")","v":"n.a."}]
[6,"Angle of vanishing stability: (option 1 & 2 only)",null,null,"degrees",null,{"$f":"'Worksheet 6'!D17","v":{"v":75,"d":"75.0"}},{"$f":"'Worksheet 6'!D18","v":{"$error":"#VALUE!"}},{"$f":"'Worksheet 6'!E18","v":{"$error":"#VALUE!"}},{"$f":"IF(OR('Worksheet 2'!E49=1,'Worksheet 2'!E49=2),IF(AND(H37>'Worksheet 6'!D17,'Worksheet 16'!I37>'Worksheet 6'!E17),\"Pass\",\"Fail\"),\"n.a.\")","v":"n.a."}]
[null,"Alternative to AVS (option 1 cat B only)",null,null,"requirements of 6.5.2 fullfilled?",{"$nulls":4},{"$f":"IF('Worksheet 6'!F21=\"Yes\",IF('Worksheet 6'!D34=\"no\",\"Fail\",\"Pass\"),\"\")","v":""},{"$nulls":16},"Abfrage STIX req"]
[7,"Stability index: (otion 1 & 2 only)",null,null,"STIX",null,{"$f":"IF('Worksheet 1'!D8=\"A\",\"> 32\",IF('Worksheet 1'!D8=\"B\",\"> 23\",IF('Worksheet 1'!D8=\"C\",\"> 14\",IF('Worksheet 1'!D8=\"D\",\"> 5\",\"\"))))","v":""},{"$f":"'Worksheet 7b)'!E24","v":{"$error":"#VALUE!"}},{"$f":"'Worksheet 7b)'!F24","v":{"$error":"#VALUE!"}},{"$f":"IF(OR('Worksheet 2'!E49=1,'Worksheet 2'!E49=2),IF(MIN(H39,I39)>AA39,\"Pass\",\"Fail\"),\"n.a.\")","v":"n.a."},{"$nulls":16},{"$f":"IF('Worksheet 1'!D8=\"A\",32,IF('Worksheet 1'!D8=\"B\",23,IF('Worksheet 1'!D8=\"C\",14,IF('Worksheet 1'!D8=\"D\",5,\"\"))))","v":""}]
[8,"Knockdown-recovery test: (options 3 + 4 only)",{"$nulls":3},"method used?",null,{"$f":"'Worksheet 8'!D9","v":{"v":0,"d":"0.00"}}]
[null,"are allrequirements met ?",{"$nulls":7},{"$f":"IF(OR('Worksheet 1'!D8=\"A\",'Worksheet 1'!D8=\"B\"),\"n.a.\",IF(OR('Worksheet 2'!E49<>3,'Worksheet 2'!E49<>4),\"n.a.\",IF(AND('Worksheet 1'!D8=\"C\",'Worksheet 8'!C22=\"C\"),\"Pass\",IF(AND('Worksheet 1'!D8=\"D\",'Worksheet 8'!D22=\"D\"),\"Pass\",\"Fail\"))))","v":"n.a."}]
[9,"Wind stiffness test: (options 5 & 6 only)",{"$nulls":7},{"$f":"'Worksheet 9'!AA23","v":""}]
[null,"was reefed sail area used (i.e. are warning labels required?)   .",{"$nulls":5},{"$f":"IF(AND('Worksheet 9'!E22=\"No\",'Worksheet 9'!E40=\"No\"),\"No\",\"Yes\")","v":"Yes"}]
[10,"Flotation requirement: ",null,"ratio mLDC/VB",null,null,"< 850",{"$f":"IF(OR('Worksheet 2'!E49=4,'Worksheet 2'!E49=6,'Worksheet 2'!E49=8),'Worksheet 10'!D40,\"\")","v":""},null,{"$f":"IF(OR('Worksheet 2'!E49=4,'Worksheet 2'!E49=6,'Worksheet 2'!E49=8),'Worksheet 10'!D41,\"\")","v":""}]
[null,"options 4,6 and 8 only"]
[11,"Capsisze recovery test:",null,"(option 7only)","are all requirements met?",null,null," Yes / No",null,{"$f":"IF('Worksheet 2'!E49=7,IF(COUNTIF('Worksheet 11'!D14:D19,\"Yes\")=5,\"Pass\",\"Fail\"),\"n.a.\")","v":"n.a."}]
[null,"Design category recommended by the builder",{"$nulls":5},{"$f":"'Worksheet 1'!D8","v":0}]
[15,"Detection & removal of water: Are all requirements satisfied?",{"$nulls":5},"Yes / No"]
["NB: Boat must pass all requirements applicable to selected option to be given intended Design Category."]
["Design Category given:",null,null,"Assessed by:"]
[]
["Doc. of downflooding opening / closing appliance  attached?"]
[]
["If applicable, cockpit calculation according to ISO 11812 attached ?",{"$nulls":6},"Signature:"]
[]
["If applicable, curve of righting moments in mMO and mLA attached ?"]
[]
["Appropriate add. information attached (e.g. photos, drawings,…) ?"]
[]
[]
[]
[]
[{"$nulls":3},"Signature:"]